program: Orca
programVersion: 5.0.2
elementType: Cl F F F O O O N C C C C C C C C C C C C C C C C C C C C C C C H H H H H H H H H H H H H H H H H H H
charge: 0
multiplicity: 1
keywords: wb97x-d3
keywords: def2-TZVPP
keywords: def2/J RIJCOSX
keywords: DEFGRID2
keywords: scfconv7
keywords: smallprint printgap noloewdin
keywords: NOSOSCF
formula: C23H19ClF3NO3
InChI: InChI=1/C23H19ClF3NO3/c1-22(2)17(12-19(24)23(25,26)27)20(22)21(29)31-18(13-28)14-7-6-10-16(11-14)30-15-8-4-3-5-9-15/h3-12,17-18,20H,1-2H3
50 atoms
Cl 4.283176 -1.996361 1.273705
F  4.330965 -4.9229 0.438901
F  5.76243 -3.745708 -0.64516
F  4.032507 -4.528243 -1.657148
O  -1.7997 -1.297593 -0.127823
O  -0.42708 0.09163 0.966408
O  -3.601777 3.977989 0.458513
N  -4.533969 -2.890471 0.825512
C  1.304202 -0.224748 -1.621857
C  1.852921 -1.123918 -0.549017
C  0.375596 -1.177697 -0.900746
C  1.273441 1.256215 -1.331325
C  1.565173 -0.530475 -3.077183
C  2.660577 -2.301223 -0.864593
C  -0.613006 -0.706675 0.08486
C  3.693418 -2.753113 -0.163121
C  -2.898979 -0.860123 0.670742
C  4.455261 -3.990867 -0.513449
C  -3.548219 0.345818 0.040277
C  -3.811131 -2.002021 0.74259
C  -3.306659 1.595938 0.589801
C  -4.306009 0.218303 -1.119341
C  -3.806345 2.726379 -0.044377
C  -4.82625 1.352342 -1.720289
C  -4.569785 2.611159 -1.195775
C  -2.363025 4.327964 0.926765
C  -2.324445 5.201159 2.004541
C  -1.187899 3.883655 0.331341
C  -1.098435 5.634685 2.487911
C  0.030497 4.317957 0.833266
C  0.083645 5.191889 1.9105
H  2.083697 -0.624738 0.385067
H  0.055863 -2.033754 -1.484173
H  1.231093 1.486979 -0.26978
H  2.177765 1.71969 -1.729578
H  0.419754 1.729596 -1.820355
H  0.851391 0.007429 -3.703186
H  2.566868 -0.204426 -3.362779
H  1.473554 -1.588156 -3.321515
H  2.379887 -2.866287 -1.745232
H  -2.580049 -0.635505 1.69283
H  -2.72714 1.686256 1.500009
H  -4.497278 -0.755586 -1.553515
H  -5.424828 1.260313 -2.616775
H  -4.960755 3.499179 -1.676082
H  -3.247905 5.539773 2.457613
H  -1.21133 3.212143 -0.51787
H  -1.071382 6.316841 3.3279
H  0.945204 3.971968 0.368686
H  1.038219 5.525675 2.295116
elementType: Cl F O N C H
totalener: -1928.18920621 hartree
nucrepener: 3135.78474741 hartree
electener: -5063.97395362 hartree
oneelecener: -8877.93162104 hartree
twoeener: 3813.95766742 hartree
cpcmener: -0.03277152 hartree
kineticenergy: 1921.62584588 hartree
xcener: -157.114977614928 hartree
chargesum: -0.0000000
charge: -0.070185 -0.173097 -0.172977 -0.171192 -0.275523 -0.443582 -0.328842 -0.087320 0.101570 0.023140 -0.082366 -0.293864 -0.262390 -0.140887 0.406049 -0.076628 0.402587 0.511570 0.001695 -0.223986 -0.172143 -0.209240 0.258186 -0.127314 -0.217003 0.285564 -0.246702 -0.198559 -0.122116 -0.145374 -0.187928 0.085306 0.099102 0.090397 0.103806 0.106734 0.099736 0.102706 0.092046 0.140547 0.134889 0.145682 0.144021 0.159992 0.148020 0.145262 0.163494 0.157415 0.162963 0.156740
qa: -0.0702 -0.1731 -0.1730 -0.1712 -0.2755 -0.4436 -0.3288 -0.0873 0.1016 0.0231 -0.0824 -0.2939 -0.2624 -0.1409 0.4060 -0.0766 0.4026 0.5116 0.0017 -0.2240 -0.1721 -0.2092 0.2582 -0.1273 -0.2170 0.2856 -0.2467 -0.1986 -0.1221 -0.1454 -0.1879 0.0853 0.0991 0.0904 0.1038 0.1067 0.0997 0.1027 0.0920 0.1405 0.1349 0.1457 0.1440 0.1600 0.1480 0.1453 0.1635 0.1574 0.1630 0.1567
va: 1.2629 1.1250 1.1274 1.1321 2.1366 2.0655 2.0851 3.1102 3.7326 3.8542 3.8712 3.9139 3.9095 3.8858 4.1778 3.9971 3.7410 4.4826 3.6406 4.0635 3.9199 3.9941 3.7506 3.9104 4.0261 3.7226 4.0030 3.8945 3.8927 3.8879 3.9328 1.0448 1.0338 1.0136 1.0025 0.9945 1.0011 1.0007 1.0069 1.0185 1.0190 1.0155 1.0081 0.9896 1.0046 1.0083 0.9875 0.9886 0.9883 0.9915
dispcorr: -0.026410332 hartree
energy: -1928.215616538294
dipole: -28.68210 28.88400 0.20190 40.92277 -39.13686 1.78591 -11.01834 9.33065 -1.68768
magnitude: 2.46546 au
magnitude: 6.26670 debye
