program: Orca
programVersion: 5.0.2
elementType: Cl F F F O O O N C C C C C C C C C C C C C C C C C C C C C C C H H H H H H H H H H H H H H H H H H H
charge: 0
multiplicity: 1
keywords: wb97x-d3
keywords: def2-TZVPP
keywords: def2/J RIJCOSX
keywords: DEFGRID2
keywords: scfconv7
keywords: smallprint printgap noloewdin
keywords: NOSOSCF
formula: C23H19ClF3NO3
InChI: InChI=1/C23H19ClF3NO3/c1-22(2)17(12-19(24)23(25,26)27)20(22)21(29)31-18(13-28)14-7-6-10-16(11-14)30-15-8-4-3-5-9-15/h3-12,17-18,20H,1-2H3
50 atoms
Cl 2.883087 0.562394 1.357219
F  4.84324 -2.767691 1.745166
F  4.669635 -1.117077 3.11487
F  5.552154 -0.814804 1.182053
O  -1.725289 -1.413119 0.295012
O  -2.101752 -3.604667 0.172036
O  -2.379565 3.530998 -0.7705
N  -4.408296 -1.823301 -1.753088
C  0.814697 -2.236112 -1.299132
C  1.123381 -1.71383 0.082337
C  0.120568 -2.833936 -0.093853
C  0.082652 -1.315738 -2.244894
C  1.808491 -3.128126 -2.00377
C  2.412606 -2.015493 0.70946
C  -1.328754 -2.681454 0.141466
C  3.235068 -1.127861 1.256557
C  -3.119018 -1.170194 0.430496
C  4.57637 -1.46479 1.827348
C  -3.299895 0.3030 0.690694
C  -3.825599 -1.56105 -0.797901
C  -2.757993 1.220723 -0.201921
C  -3.991188 0.728276 1.813811
C  -2.886383 2.576243 0.057071
C  -4.139437 2.09063 2.04235
C  -3.584147 3.016868 1.177199
C  -1.284297 3.239537 -1.545802
C  -0.109333 2.760048 -0.979096
C  -1.370436 3.484125 -2.907043
C  0.986251 2.521477 -1.795026
C  -0.261613 3.251783 -3.710596
C  0.915993 2.766453 -3.160939
H  0.713839 -0.73366 0.295824
H  0.460121 -3.829854 0.16898
H  0.806614 -0.786157 -2.866887
H  -0.568811 -1.883874 -2.912119
H  -0.520331 -0.562473 -1.742894
H  2.26027 -3.871989 -1.3487
H  1.31536 -3.667724 -2.814055
H  2.611663 -2.533765 -2.443162
H  2.733359 -3.050379 0.705959
H  -3.539886 -1.753301 1.254934
H  -2.241812 0.87743 -1.090621
H  -4.408553 0.007899 2.505539
H  -4.679855 2.434231 2.914342
H  -3.687077 4.078298 1.364859
H  -0.044472 2.575438 0.086446
H  -2.293461 3.857154 -3.332953
H  1.902112 2.146248 -1.356949
H  -0.325979 3.445683 -4.773483
H  1.775852 2.582072 -3.791356
elementType: Cl F O N C H
totalener: -1928.18804913 hartree
nucrepener: 3256.34123573 hartree
electener: -5184.52928486 hartree
oneelecener: -9118.68711282 hartree
twoeener: 3934.15782796 hartree
cpcmener: -0.03573679 hartree
kineticenergy: 1921.60345689 hartree
xcener: -157.111599508572 hartree
chargesum: -0.0000000
charge: -0.078052 -0.170796 -0.173365 -0.173410 -0.265955 -0.429312 -0.327021 -0.083747 0.117209 0.067035 -0.115881 -0.263075 -0.262148 -0.161610 0.403963 -0.064548 0.376042 0.507954 0.008073 -0.223806 -0.212044 -0.199319 0.241983 -0.111473 -0.226869 0.269803 -0.173073 -0.229344 -0.149315 -0.120227 -0.181653 0.079696 0.101159 0.101470 0.113152 0.049389 0.090783 0.101549 0.102295 0.144524 0.132218 0.172602 0.146341 0.158913 0.147445 0.152780 0.146161 0.146374 0.158375 0.158756
qa: -0.0781 -0.1708 -0.1734 -0.1734 -0.2660 -0.4293 -0.3270 -0.0837 0.1172 0.0670 -0.1159 -0.2631 -0.2621 -0.1616 0.4040 -0.0645 0.3760 0.5080 0.0081 -0.2238 -0.2120 -0.1993 0.2420 -0.1115 -0.2269 0.2698 -0.1731 -0.2293 -0.1493 -0.1202 -0.1817 0.0797 0.1012 0.1015 0.1132 0.0494 0.0908 0.1015 0.1023 0.1445 0.1322 0.1726 0.1463 0.1589 0.1474 0.1528 0.1462 0.1464 0.1584 0.1588
va: 1.2595 1.1331 1.1284 1.1250 2.1637 2.0756 2.0872 3.1067 3.7195 3.8040 3.9300 3.9320 3.9128 3.8565 4.1875 3.9672 3.7949 4.4878 3.7076 4.0145 3.9239 3.9502 3.8048 3.9063 4.0060 3.7125 3.8652 4.0096 3.8289 3.8789 3.9097 1.0327 1.0301 1.0013 1.0054 1.0126 1.0060 1.0009 1.0006 1.0147 1.0195 0.9859 1.0021 0.9892 1.0058 0.9997 1.0068 1.0050 0.9884 0.9905
dispcorr: -0.028774623 hartree
energy: -1928.216823754425
dipole: -26.07826 26.80338 0.72512 4.12455 -3.62701 0.49754 -25.05529 25.41953 0.36425
magnitude: 0.95185 au
magnitude: 2.41941 debye
