program: Orca
programVersion: 5.0.2
elementType: Cl F F F O O O N C C C C C C C C C C C C C C C C C C C C C C C H H H H H H H H H H H H H H H H H H H
charge: 0
multiplicity: 1
keywords: wb97x-d3
keywords: def2-TZVPP
keywords: def2/J RIJCOSX
keywords: DEFGRID2
keywords: scfconv7
keywords: smallprint printgap noloewdin
keywords: NOSOSCF
formula: C23H19ClF3NO3
InChI: InChI=1/C23H19ClF3NO3/c1-22(2)17(12-19(24)23(25,26)27)20(22)21(29)31-18(13-28)14-7-6-10-16(11-14)30-15-8-4-3-5-9-15/h3-12,17-18,20H,1-2H3
50 atoms
Cl 2.641126 -2.627877 1.396471
F  5.192916 -3.85403 -1.258364
F  3.961828 -5.038744 0.051893
F  5.389502 -3.664886 0.8789
O  -1.278528 -1.297511 0.249831
O  0.052089 0.492421 0.413959
O  -3.572843 4.024333 0.157807
N  -3.926649 -2.461956 1.848199
C  1.192759 -0.751898 -2.267389
C  2.13345 -0.94821 -1.130632
C  0.693604 -1.361391 -0.959903
C  0.798767 0.649532 -2.65865
C  1.249986 -1.707248 -3.433555
C  3.177922 -1.992694 -1.151279
C  -0.165268 -0.602426 -0.038118
C  3.469171 -2.758973 -0.110094
C  -2.264793 -0.62357 1.024673
C  4.511499 -3.831112 -0.113695
C  -2.988415 0.414562 0.201495
C  -3.184367 -1.669574 1.475547
C  -2.952585 1.740146 0.602291
C  -3.637228 0.044073 -0.971899
C  -3.556065 2.707103 -0.192173
C  -4.251857 1.017303 -1.742365
C  -4.206832 2.351254 -1.364134
C  -2.46922 4.60478 0.723548
C  -1.17605 4.307462 0.308754
C  -2.69761 5.562095 1.701981
C  -0.109504 4.976348 0.89211
C  -1.621464 6.230403 2.267587
C  -0.323912 5.938099 1.870518
H  2.418994 -0.048167 -0.590814
H  0.477509 -2.422744 -1.009369
H  1.458743 1.005527 -3.451807
H  -0.221902 0.673818 -3.044796
H  0.867513 1.361323 -1.838814
H  2.003604 -1.385556 -4.1550
H  1.490788 -2.727507 -3.132058
H  0.289708 -1.7361 -3.950807
H  3.746865 -2.123905 -2.064761
H  -1.823995 -0.169014 1.917647
H  -2.44827 2.012883 1.521446
H  -3.66661 -0.992379 -1.285047
H  -4.762787 0.739491 -2.654822
H  -4.675785 3.113418 -1.973619
H  -0.991878 3.567829 -0.460679
H  -3.711332 5.783869 2.012331
H  0.89782 4.744189 0.570536
H  -1.802099 6.978661 3.028675
H  0.513813 6.456813 2.317583
elementType: Cl F O N C H
totalener: -1928.18653254 hartree
nucrepener: 3159.77879858 hartree
electener: -5087.96533112 hartree
oneelecener: -8926.43710879 hartree
twoeener: 3838.47177767 hartree
cpcmener: -0.03217652 hartree
kineticenergy: 1921.64092803 hartree
xcener: -157.116467059540 hartree
chargesum: 0.0000000
charge: -0.064941 -0.170239 -0.172054 -0.171747 -0.272626 -0.440174 -0.328142 -0.085970 0.131753 -0.046391 -0.134746 -0.269665 -0.278823 -0.136586 0.387646 -0.036875 0.408243 0.501718 0.020939 -0.226952 -0.187108 -0.229418 0.269530 -0.125433 -0.220820 0.283455 -0.186807 -0.245653 -0.150988 -0.121601 -0.181644 0.116329 0.115994 0.099876 0.100646 0.090489 0.102525 0.094757 0.100106 0.150989 0.136424 0.145886 0.146431 0.159516 0.148783 0.156411 0.145594 0.157429 0.157129 0.156808
qa: -0.0649 -0.1702 -0.1721 -0.1717 -0.2726 -0.4402 -0.3281 -0.0860 0.1318 -0.0464 -0.1347 -0.2697 -0.2788 -0.1366 0.3876 -0.0369 0.4082 0.5017 0.0209 -0.2270 -0.1871 -0.2294 0.2695 -0.1254 -0.2208 0.2835 -0.1868 -0.2457 -0.1510 -0.1216 -0.1816 0.1163 0.1160 0.0999 0.1006 0.0905 0.1025 0.0948 0.1001 0.1510 0.1364 0.1459 0.1464 0.1595 0.1488 0.1564 0.1456 0.1574 0.1571 0.1568
va: 1.2724 1.1344 1.1271 1.1319 2.1319 2.0697 2.0844 3.1130 3.7327 3.8780 3.8282 3.8996 3.9126 3.8601 4.1678 3.9592 3.7403 4.4947 3.5746 4.0713 3.9337 3.9790 3.7443 3.9064 4.0144 3.6988 3.8983 4.0032 3.9035 3.8847 3.9058 1.0251 1.0242 1.0027 0.9993 1.0145 0.9999 1.0005 1.0029 1.0056 1.0178 1.0085 1.0105 0.9893 1.0046 0.9937 1.0082 0.9911 0.9892 0.9907
dispcorr: -0.026586948 hartree
energy: -1928.213119483120
dipole: -26.66452 27.47986 0.81534 38.42826 -36.96938 1.45887 -18.75918 16.62703 -2.13216
magnitude: 2.70909 au
magnitude: 6.88597 debye
