program: Orca
programVersion: 5.0.2
elementType: Cl F F F O O O N C C C C C C C C C C C C C C C C C C C C C C C H H H H H H H H H H H H H H H H H H H
charge: 0
multiplicity: 1
keywords: wb97x-d3
keywords: def2-TZVPP
keywords: def2/J RIJCOSX
keywords: DEFGRID2
keywords: scfconv7
keywords: smallprint printgap noloewdin
keywords: NOSOSCF
formula: C23H19ClF3NO3
InChI: InChI=1/C23H19ClF3NO3/c1-22(2)17(12-19(24)23(25,26)27)20(22)21(29)31-18(13-28)14-7-6-10-16(11-14)30-15-8-4-3-5-9-15/h3-12,17-18,20H,1-2H3
50 atoms
Cl 3.441658 -0.499579 -1.854622
F  4.82061 0.911293 0.41532
F  5.526978 -1.108556 0.258673
F  4.304944 -0.524748 1.930585
O  -2.493629 -1.62697 0.993389
O  -1.910824 -1.219549 -1.123949
O  -2.008788 3.378774 0.866882
N  -4.985482 -2.615541 -1.108739
C  0.494948 -3.097573 -0.29897
C  0.954775 -1.6648 -0.344807
C  -0.28181 -2.029368 0.445369
C  -0.044153 -3.70036 -1.571673
C  1.241126 -4.089885 0.559286
C  2.153296 -1.245106 0.390442
C  -1.604121 -1.577506 -0.018171
C  3.253864 -0.742878 -0.155468
C  -3.813166 -1.188834 0.745263
C  4.475775 -0.364588 0.619708
C  -3.932679 0.300583 0.47725
C  -4.437363 -1.985254 -0.320661
C  -2.899632 1.155679 0.826173
C  -5.106326 0.812398 -0.065595
C  -3.021241 2.514043 0.562966
C  -5.229934 2.1764 -0.275424
C  -4.182796 3.036261 0.019557
C  -0.733249 3.090562 0.461454
C  -0.456867 2.375191 -0.698869
C  0.297262 3.592539 1.244813
C  0.865318 2.167588 -1.065221
C  1.61322 3.382305 0.859941
C  1.904731 2.666682 -0.293039
H  0.776373 -1.161652 -1.289129
H  -0.1721 -2.055765 1.523963
H  -0.804746 -4.45187 -1.352031
H  -0.476691 -2.967291 -2.24855
H  0.766105 -4.198631 -2.10665
H  2.138069 -4.439159 0.044581
H  1.54604 -3.681169 1.522024
H  0.613518 -4.960245 0.757717
H  2.144789 -1.37451 1.466186
H  -4.35602 -1.429819 1.664243
H  -1.992452 0.7888 1.289795
H  -5.927462 0.157332 -0.328696
H  -6.1446 2.572234 -0.69611
H  -4.264037 4.098333 -0.17321
H  -1.251922 1.986823 -1.32253
H  0.067663 4.147859 2.145647
H  1.078192 1.613866 -1.970302
H  2.414077 3.7774 1.471633
H  2.930785 2.507891 -0.592889
elementType: Cl F O N C H
totalener: -1928.18674069 hartree
nucrepener: 3319.96491706 hartree
electener: -5248.15165775 hartree
oneelecener: -9246.90403556 hartree
twoeener: 3998.75237781 hartree
cpcmener: -0.03403673 hartree
kineticenergy: 1921.62195589 hartree
xcener: -157.120016798340 hartree
chargesum: -0.0000000
charge: -0.069312 -0.170577 -0.172449 -0.171281 -0.287967 -0.422616 -0.329166 -0.084842 0.103902 -0.026904 -0.062310 -0.270572 -0.251965 -0.106186 0.359457 -0.099939 0.491471 0.515864 -0.010457 -0.248711 -0.231585 -0.214408 0.264232 -0.118245 -0.222156 0.306483 -0.202835 -0.258298 -0.148467 -0.113480 -0.179602 0.095045 0.099145 0.103458 0.096274 0.099044 0.103320 0.090213 0.101168 0.146880 0.151282 0.149779 0.138655 0.158484 0.148060 0.150692 0.144467 0.152364 0.156966 0.147625
qa: -0.0693 -0.1706 -0.1724 -0.1713 -0.2880 -0.4226 -0.3292 -0.0848 0.1039 -0.0269 -0.0623 -0.2706 -0.2520 -0.1062 0.3595 -0.0999 0.4915 0.5159 -0.0105 -0.2487 -0.2316 -0.2144 0.2642 -0.1182 -0.2222 0.3065 -0.2028 -0.2583 -0.1485 -0.1135 -0.1796 0.0950 0.0991 0.1035 0.0963 0.0990 0.1033 0.0902 0.1012 0.1469 0.1513 0.1498 0.1387 0.1585 0.1481 0.1507 0.1445 0.1524 0.1570 0.1476
va: 1.2623 1.1239 1.1263 1.1332 2.1369 2.0729 2.0849 3.1022 3.8134 3.8454 3.8772 3.9053 3.9018 3.7878 4.1793 3.9880 3.7748 4.4693 3.7215 4.0895 3.9627 3.9781 3.7465 3.9040 4.0262 3.6673 3.8974 4.0248 3.8407 3.9278 3.8519 1.0328 1.0366 0.9999 1.0181 1.0009 1.0011 1.0046 1.0021 1.0115 0.9888 1.0099 1.0108 0.9901 1.0040 1.0058 1.0085 1.0019 0.9897 1.0092
dispcorr: -0.030280721 hartree
energy: -1928.217021408306
dipole: -28.40076 28.29370 -0.10706 -7.12634 6.69287 -0.43347 -0.25613 2.15051 1.89438
magnitude: 1.94629 au
magnitude: 4.94707 debye
