program: Orca
programVersion: 5.0.2
elementType: Cl F F F O O O N C C C C C C C C C C C C C C C C C C C C C C C H H H H H H H H H H H H H H H H H H H
charge: 0
multiplicity: 1
keywords: wb97x-d3
keywords: def2-TZVPP
keywords: def2/J RIJCOSX
keywords: DEFGRID2
keywords: scfconv7
keywords: smallprint printgap noloewdin
keywords: NOSOSCF
formula: C23H19ClF3NO3
InChI: InChI=1/C23H19ClF3NO3/c1-22(2)17(12-19(24)23(25,26)27)20(22)21(29)31-18(13-28)14-7-6-10-16(11-14)30-15-8-4-3-5-9-15/h3-12,17-18,20H,1-2H3
50 atoms
Cl 2.055462 0.105885 -1.235449
F  4.833778 -0.053213 -0.175615
F  4.318533 -0.781465 1.785825
F  3.639252 1.153589 1.134851
O  -1.993861 -1.883304 -0.223681
O  -2.520397 -2.342297 1.894525
O  -1.158442 3.086953 0.711915
N  -3.595057 -1.022017 -2.974581
C  0.397978 -3.81355 0.315282
C  0.766233 -2.364067 0.174047
C  -0.311317 -2.781922 1.163169
C  -0.298594 -4.466522 -0.853377
C  1.306431 -4.759738 1.061664
C  1.999877 -1.777873 0.696971
C  -1.710317 -2.338757 1.004738
C  2.617139 -0.724433 0.171311
C  -3.246101 -1.240692 -0.394961
C  3.855709 -0.105494 0.734878
C  -3.27616 0.134584 0.235619
C  -3.424384 -1.130406 -1.844233
C  -2.16107 0.960577 0.139792
C  -4.424847 0.55889 0.885042
C  -2.215255 2.230622 0.696899
C  -4.462317 1.831904 1.436757
C  -3.36653 2.671201 1.341311
C  -0.230644 3.140222 -0.292797
C  1.06674 3.456768 0.08762
C  -0.555859 2.977779 -1.633476
C  2.043143 3.620898 -0.882483
C  0.437676 3.12753 -2.591613
C  1.735776 3.45306 -2.225215
H  0.393908 -1.904202 -0.732176
H  -0.024408 -2.794715 2.208827
H  0.442574 -4.926442 -1.509258
H  -0.969323 -5.256234 -0.510054
H  -0.877797 -3.771643 -1.457514
H  2.122347 -5.093644 0.418229
H  1.74394 -4.320583 1.957663
H  0.748659 -5.64399 1.374748
H  2.428068 -2.216939 1.590177
H  -4.067318 -1.85266 -0.007828
H  -1.262231 0.617124 -0.357792
H  -5.282242 -0.097334 0.963229
H  -5.35266 2.173332 1.947891
H  -3.392062 3.663854 1.772967
H  1.303437 3.585479 1.136561
H  -1.568386 2.747546 -1.94039
H  3.052235 3.873092 -0.582942
H  0.184156 2.999605 -3.636185
H  2.501686 3.572929 -2.980122
elementType: Cl F O N C H
totalener: -1928.18563433 hartree
nucrepener: 3354.06412231 hartree
electener: -5282.24975664 hartree
oneelecener: -9315.26948239 hartree
twoeener: 4033.01972574 hartree
cpcmener: -0.03321130 hartree
kineticenergy: 1921.62396306 hartree
xcener: -157.117946101896 hartree
chargesum: -0.0000000
charge: -0.075548 -0.175440 -0.171328 -0.171518 -0.283489 -0.425200 -0.321411 -0.085764 0.074342 0.031746 -0.060236 -0.256924 -0.271782 -0.153546 0.380343 -0.054420 0.374921 0.510497 0.030817 -0.227509 -0.217825 -0.218415 0.306874 -0.099800 -0.250956 0.348051 -0.284627 -0.233538 -0.104341 -0.124690 -0.201696 0.087673 0.102697 0.098117 0.100775 0.094101 0.102697 0.092059 0.099756 0.142066 0.146847 0.129602 0.144510 0.159025 0.147403 0.142974 0.156021 0.153579 0.158230 0.154285
qa: -0.0755 -0.1754 -0.1713 -0.1715 -0.2835 -0.4252 -0.3214 -0.0858 0.0743 0.0317 -0.0602 -0.2569 -0.2718 -0.1535 0.3803 -0.0544 0.3749 0.5105 0.0308 -0.2275 -0.2178 -0.2184 0.3069 -0.0998 -0.2510 0.3481 -0.2846 -0.2335 -0.1043 -0.1247 -0.2017 0.0877 0.1027 0.0981 0.1008 0.0941 0.1027 0.0921 0.0998 0.1421 0.1468 0.1296 0.1445 0.1590 0.1474 0.1430 0.1560 0.1536 0.1582 0.1543
va: 1.2697 1.1261 1.1324 1.1212 2.1144 2.0857 2.0972 3.1063 3.8025 3.7905 3.8339 3.9084 3.9152 3.8882 4.1996 3.9671 3.7552 4.4740 3.6240 4.0654 3.9804 3.9914 3.7115 3.8871 4.0054 3.6152 3.9922 3.9225 3.8223 3.8457 3.8865 1.0419 1.0267 1.0003 1.0007 1.0113 1.0002 1.0061 1.0010 1.0184 1.0157 1.0154 1.0027 0.9890 1.0068 1.0106 0.9978 0.9916 0.9897 0.9921
dispcorr: -0.029424271 hartree
energy: -1928.215058603466
dipole: -22.26206 22.29304 0.03098 -14.03110 12.64211 -1.38899 -1.11494 2.00190 0.88696
magnitude: 1.64832 au
magnitude: 4.18969 debye
