program: Orca
programVersion: 5.0.2
elementType: Cl F F F O O O N C C C C C C C C C C C C C C C C C C C C C C C H H H H H H H H H H H H H H H H H H H
charge: 0
multiplicity: 1
keywords: wb97x-d3
keywords: def2-TZVPP
keywords: def2/J RIJCOSX
keywords: DEFGRID2
keywords: scfconv7
keywords: smallprint printgap noloewdin
keywords: NOSOSCF
formula: C23H19ClF3NO3
InChI: InChI=1/C23H19ClF3NO3/c1-22(2)17(12-19(24)23(25,26)27)20(22)21(29)31-18(13-28)14-7-6-10-16(11-14)30-15-8-4-3-5-9-15/h3-12,17-18,20H,1-2H3
50 atoms
Cl 3.400344 -4.320541 1.261257
F  4.375685 -5.649447 -1.267687
F  5.867627 -4.334681 -0.463096
F  4.866688 -3.824056 -2.298386
O  -1.456253 -0.898942 -1.342167
O  -0.98808 -1.735502 0.675527
O  -1.709228 3.723673 0.50573
N  -4.1512 -0.321613 -3.157006
C  1.777686 -0.38155 -0.130333
C  1.889007 -1.883753 -0.059186
C  0.781216 -1.247514 -0.870487
C  1.372861 0.345989 1.128655
C  2.733621 0.413549 -0.985154
C  2.939862 -2.608541 -0.775681
C  -0.611321 -1.345225 -0.397372
C  3.630922 -3.643828 -0.31195
C  -2.814997 -0.759322 -0.955438
C  4.687562 -4.360564 -1.091792
C  -3.022351 0.397109 -0.001821
C  -3.546351 -0.519223 -2.201371
C  -2.307581 1.573548 -0.182648
C  -3.940574 0.281421 1.030668
C  -2.498902 2.630134 0.695316
C  -4.133582 1.353425 1.89014
C  -3.413295 2.527478 1.738077
C  -2.166218 4.978357 0.811004
C  -1.290122 5.828893 1.468721
C  -3.426252 5.415833 0.422148
C  -1.679399 7.133856 1.736276
C  -3.806493 6.718701 0.708444
C  -2.9387 7.582306 1.364016
H  1.577497 -2.313048 0.886036
H  0.893938 -1.255036 -1.949109
H  2.266461 0.640308 1.681724
H  0.82152 1.257448 0.887976
H  0.759712 -0.25232 1.79918
H  2.303619 1.390748 -1.211469
H  3.672956 0.579652 -0.454694
H  2.96452 -0.066382 -1.935446
H  3.168497 -2.275027 -1.780662
H  -3.203375 -1.684755 -0.517358
H  -1.596353 1.681834 -0.993045
H  -4.495375 -0.637894 1.168695
H  -4.842182 1.269491 2.703517
H  -3.560603 3.343785 2.433494
H  -0.310081 5.473084 1.761337
H  -4.104984 4.755522 -0.103563
H  -0.993764 7.798499 2.245906
H  -4.788159 7.06094 0.407297
H  -3.241367 8.59854 1.579451
elementType: Cl F O N C H
totalener: -1928.18978010 hartree
nucrepener: 3063.01622153 hartree
electener: -4991.20600163 hartree
oneelecener: -8732.72014386 hartree
twoeener: 3741.51414223 hartree
cpcmener: -0.03362998 hartree
kineticenergy: 1921.61503937 hartree
xcener: -157.113084144964 hartree
chargesum: -0.0000000
charge: -0.070709 -0.173191 -0.173107 -0.171326 -0.279497 -0.424450 -0.330021 -0.086075 0.086236 0.020258 -0.059225 -0.267281 -0.261120 -0.142728 0.350604 -0.076809 0.407685 0.511215 0.050191 -0.228943 -0.280343 -0.205376 0.283280 -0.125370 -0.186590 0.263527 -0.237400 -0.183650 -0.129090 -0.149722 -0.174195 0.081513 0.102326 0.105233 0.095935 0.098075 0.100698 0.102859 0.091129 0.142233 0.144217 0.136419 0.144387 0.160545 0.158867 0.146299 0.157751 0.157765 0.158776 0.158197
qa: -0.0707 -0.1732 -0.1731 -0.1713 -0.2795 -0.4244 -0.3300 -0.0861 0.0862 0.0203 -0.0592 -0.2673 -0.2611 -0.1427 0.3506 -0.0768 0.4077 0.5112 0.0502 -0.2289 -0.2803 -0.2054 0.2833 -0.1254 -0.1866 0.2635 -0.2374 -0.1837 -0.1291 -0.1497 -0.1742 0.0815 0.1023 0.1052 0.0959 0.0981 0.1007 0.1029 0.0911 0.1422 0.1442 0.1364 0.1444 0.1605 0.1589 0.1463 0.1578 0.1578 0.1588 0.1582
va: 1.2622 1.1259 1.1260 1.1319 2.1199 2.0860 2.0547 3.1123 3.7605 3.8696 3.8257 3.9039 3.9049 3.8817 4.2517 3.9928 3.7162 4.4834 3.5877 4.0792 4.0321 4.0011 3.7236 3.9027 3.9298 3.7135 4.0034 3.9102 3.8907 3.8950 3.8971 1.0497 1.0320 1.0017 1.0021 1.0161 1.0016 1.0008 1.0060 1.0172 1.0152 1.0283 1.0029 0.9904 0.9946 1.0069 0.9968 0.9897 0.9905 0.9902
dispcorr: -0.025207389 hartree
energy: -1928.214987486141
dipole: -30.83190 30.64405 -0.18785 51.82973 -49.85636 1.97337 10.38888 -9.30449 1.08439
magnitude: 2.25951 au
magnitude: 5.74321 debye
