program: Orca
programVersion: 5.0.2
elementType: Cl F F F O O O N C C C C C C C C C C C C C C C C C C C C C C C H H H H H H H H H H H H H H H H H H H
charge: 0
multiplicity: 1
keywords: wb97x-d3
keywords: def2-TZVPP
keywords: def2/J RIJCOSX
keywords: DEFGRID2
keywords: scfconv7
keywords: smallprint printgap noloewdin
keywords: NOSOSCF
formula: C23H19ClF3NO3
InChI: InChI=1/C23H19ClF3NO3/c1-22(2)17(12-19(24)23(25,26)27)20(22)21(29)31-18(13-28)14-7-6-10-16(11-14)30-15-8-4-3-5-9-15/h3-12,17-18,20H,1-2H3
50 atoms
Cl 2.641892 -5.238002 -1.059669
F  5.560586 -4.931022 -0.622204
F  5.678126 -2.820492 -1.023563
F  5.076067 -4.186404 -2.575563
O  -0.660643 0.273502 -0.961647
O  -1.232542 -1.84813 -0.549583
O  -3.158132 3.496541 2.370317
N  -1.837113 2.488356 -3.123737
C  1.303934 -1.675957 1.289477
C  1.621402 -2.464559 0.046495
C  0.989891 -1.089254 -0.070786
C  0.203805 -2.196531 2.181794
C  2.414327 -1.001779 2.058485
C  3.006506 -2.646474 -0.393493
C  -0.40295 -0.976918 -0.542064
C  3.536915 -3.773423 -0.85594
C  -1.994087 0.545762 -1.384394
C  4.968024 -3.921363 -1.26867
C  -2.881912 0.931292 -0.225629
C  -1.885003 1.637678 -2.353584
C  -2.587084 2.067226 0.520234
C  -3.9722 0.136223 0.099378
C  -3.409922 2.41182 1.582511
C  -4.776457 0.486068 1.174902
C  -4.504939 1.624533 1.91529
C  -2.774951 4.682239 1.801495
C  -1.816093 5.425313 2.474622
C  -3.355548 5.162032 0.633497
C  -1.433223 6.660182 1.970673
C  -2.954604 6.393703 0.136493
C  -1.993744 7.146749 0.797941
H  0.948721 -3.292191 -0.146045
H  1.639392 -0.27942 -0.383165
H  0.641327 -2.806677 2.973766
H  -0.330542 -1.37268 2.658712
H  -0.52184 -2.815995 1.66017
H  1.999743 -0.228851 2.707836
H  2.935386 -1.721815 2.692013
H  3.153052 -0.52232 1.417434
H  3.662832 -1.787472 -0.322362
H  -2.422117 -0.311528 -1.912817
H  -1.728232 2.681406 0.272956
H  -4.194519 -0.748058 -0.483702
H  -5.628363 -0.128649 1.43357
H  -5.137303 1.906107 2.747947
H  -1.377259 5.041017 3.387019
H  -4.115165 4.590537 0.114656
H  -0.685607 7.239222 2.497284
H  -3.404984 6.76722 -0.774146
H  -1.687496 8.106538 0.403223
elementType: Cl F O N C H
totalener: -1928.19043165 hartree
nucrepener: 3051.87288095 hartree
electener: -4980.06331260 hartree
oneelecener: -8710.53177536 hartree
twoeener: 3730.46846275 hartree
cpcmener: -0.03258028 hartree
kineticenergy: 1921.59364541 hartree
xcener: -157.108046805066 hartree
chargesum: -0.0000000
charge: -0.071030 -0.173231 -0.171219 -0.173204 -0.284068 -0.439938 -0.329737 -0.088388 0.085683 0.019720 -0.080438 -0.270132 -0.265438 -0.142103 0.393260 -0.073215 0.422292 0.511587 0.016001 -0.233912 -0.178565 -0.183454 0.214434 -0.124169 -0.214559 0.268139 -0.242944 -0.178359 -0.123206 -0.146049 -0.182953 0.083442 0.100710 0.100123 0.103102 0.097300 0.100879 0.103578 0.092151 0.141398 0.137822 0.148028 0.145997 0.159062 0.149417 0.145911 0.155794 0.157838 0.158940 0.157704
qa: -0.0710 -0.1732 -0.1712 -0.1732 -0.2841 -0.4399 -0.3297 -0.0884 0.0857 0.0197 -0.0804 -0.2701 -0.2654 -0.1421 0.3933 -0.0732 0.4223 0.5116 0.0160 -0.2339 -0.1786 -0.1835 0.2144 -0.1242 -0.2146 0.2681 -0.2429 -0.1784 -0.1232 -0.1460 -0.1830 0.0834 0.1007 0.1001 0.1031 0.0973 0.1009 0.1036 0.0922 0.1414 0.1378 0.1480 0.1460 0.1591 0.1494 0.1459 0.1558 0.1578 0.1589 0.1577
va: 1.2623 1.1263 1.1325 1.1253 2.1362 2.0736 2.0742 3.1105 3.7465 3.8563 3.8694 3.9080 3.9111 3.8845 4.2012 3.9905 3.7215 4.4828 3.5993 4.0795 3.9532 3.9454 3.7883 3.9099 4.0069 3.7047 4.0055 3.8930 3.8874 3.8967 3.9034 1.0481 1.0324 1.0004 0.9984 1.0171 1.0010 1.0002 1.0062 1.0174 1.0183 1.0118 1.0067 0.9896 1.0036 1.0078 0.9977 0.9891 0.9904 0.9904
dispcorr: -0.024347515 hartree
energy: -1928.214779169353
dipole: -34.24141 33.66977 -0.57164 37.78579 -37.22123 0.56456 24.59545 -22.76611 1.82933
magnitude: 1.99799 au
magnitude: 5.07848 debye
