program: Orca
programVersion: 5.0.2
elementType: Cl F F F O O O N C C C C C C C C C C C C C C C C C C C C C C C H H H H H H H H H H H H H H H H H H H
charge: 0
multiplicity: 1
keywords: wb97x-d3
keywords: def2-TZVPP
keywords: def2/J RIJCOSX
keywords: DEFGRID2
keywords: scfconv7
keywords: smallprint printgap noloewdin
keywords: NOSOSCF
formula: C23H19ClF3NO3
InChI: InChI=1/C23H19ClF3NO3/c1-22(2)17(12-19(24)23(25,26)27)20(22)21(29)31-18(13-28)14-7-6-10-16(11-14)30-15-8-4-3-5-9-15/h3-12,17-18,20H,1-2H3
50 atoms
Cl 2.707341 -0.085581 -1.604865
F  4.433105 0.7968 0.773332
F  5.340514 -0.747646 -0.404472
F  4.635208 -1.188028 1.579871
O  -2.02145 -1.629214 -0.275978
O  -2.321148 -1.862835 1.921166
O  -2.03741 3.516396 -0.291901
N  -3.91787 -1.425605 -2.959936
C  0.362318 -3.49648 0.083569
C  0.84345 -2.071683 -0.005402
C  -0.222455 -2.453978 1.010031
C  -0.415717 -4.04534 -1.08844
C  1.221201 -4.548023 0.745639
C  2.16154 -1.683922 0.501009
C  -1.610153 -1.95766 0.954125
C  3.019794 -0.863289 -0.094865
C  -3.369565 -1.204839 -0.414114
C  4.358891 -0.505216 0.46917
C  -3.581857 0.221279 0.035282
C  -3.661094 -1.335258 -1.844289
C  -2.669716 1.199493 -0.337257
C  -4.700098 0.543397 0.790967
C  -2.880971 2.508239 0.072113
C  -4.910529 1.86151 1.16838
C  -4.000291 2.846616 0.820603
C  -0.682697 3.352796 -0.186773
C  0.099385 3.999529 -1.133342
C  -0.094987 2.630819 0.845563
C  1.481462 3.926439 -1.041004
C  1.288978 2.555543 0.91567
C  2.082943 3.201152 -0.02225
H  0.492803 -1.530237 -0.875856
H  0.118955 -2.5288 2.036333
H  0.263557 -4.599705 -1.738268
H  -1.187049 -4.741314 -0.753172
H  -0.888733 -3.280816 -1.699313
H  0.60666 -5.405805 1.024497
H  1.991525 -4.902911 0.058649
H  1.713577 -4.196769 1.651329
H  2.46566 -2.110843 1.449192
H  -4.051702 -1.87339 0.121541
H  -1.804899 0.950137 -0.941415
H  -5.402528 -0.227494 1.081498
H  -5.781521 2.12251 1.754752
H  -4.154494 3.874063 1.125306
H  -0.372172 4.560136 -1.930908
H  -0.699756 2.134943 1.594655
H  2.089467 4.434874 -1.778226
H  1.744838 1.992428 1.719821
H  3.160721 3.143266 0.039472
elementType: Cl F O N C H
totalener: -1928.18714666 hartree
nucrepener: 3305.36676138 hartree
electener: -5233.55390804 hartree
oneelecener: -9217.37556853 hartree
twoeener: 3983.82166049 hartree
cpcmener: -0.03434355 hartree
kineticenergy: 1921.61431014 hartree
xcener: -157.113948184903 hartree
chargesum: -0.0000000
charge: -0.072770 -0.169285 -0.172392 -0.171667 -0.277261 -0.432944 -0.328544 -0.084886 0.086402 0.042718 -0.084965 -0.265231 -0.264510 -0.157533 0.399315 -0.075125 0.384171 0.513882 0.033073 -0.232719 -0.168119 -0.201526 0.215733 -0.118003 -0.218316 0.288880 -0.256602 -0.185826 -0.106383 -0.137539 -0.209738 0.092958 0.096692 0.097549 0.103914 0.092062 0.101075 0.101467 0.091402 0.141207 0.143201 0.147787 0.145195 0.159360 0.148995 0.145473 0.152460 0.157122 0.155678 0.154116
qa: -0.0728 -0.1693 -0.1724 -0.1717 -0.2773 -0.4329 -0.3285 -0.0849 0.0864 0.0427 -0.0850 -0.2652 -0.2645 -0.1575 0.3993 -0.0751 0.3842 0.5139 0.0331 -0.2327 -0.1681 -0.2015 0.2157 -0.1180 -0.2183 0.2889 -0.2566 -0.1858 -0.1064 -0.1375 -0.2097 0.0930 0.0967 0.0975 0.1039 0.0921 0.1011 0.1015 0.0914 0.1412 0.1432 0.1478 0.1452 0.1594 0.1490 0.1455 0.1525 0.1571 0.1557 0.1541
va: 1.2544 1.1210 1.1283 1.1325 2.1259 2.0782 2.0784 3.1076 3.7512 3.8149 3.8813 3.9171 3.9199 3.8670 4.1805 3.9781 3.7580 4.4673 3.5940 4.0731 3.9299 3.9820 3.7870 3.8989 4.0082 3.6828 4.0182 3.9006 3.8831 3.8387 3.8713 1.0328 1.0308 1.0007 0.9997 1.0103 1.0004 1.0007 1.0067 1.0183 1.0165 1.0133 1.0026 0.9892 1.0037 1.0083 1.0012 0.9888 0.9964 1.0004
dispcorr: -0.029032907 hartree
energy: -1928.216179570018
dipole: -26.57059 26.51169 -0.05890 -10.26038 8.98498 -1.27539 4.31619 -2.94055 1.37564
magnitude: 1.87683 au
magnitude: 4.77052 debye
