program: Orca
programVersion: 5.0.2
elementType: Cl F F F O O O N C C C C C C C C C C C C C C C C C C C C C C C H H H H H H H H H H H H H H H H H H H
charge: 0
multiplicity: 1
keywords: wb97x-d3
keywords: def2-TZVPP
keywords: def2/J RIJCOSX
keywords: DEFGRID2
keywords: scfconv7
keywords: smallprint printgap noloewdin
keywords: NOSOSCF
formula: C23H19ClF3NO3
InChI: InChI=1/C23H19ClF3NO3/c1-22(2)17(12-19(24)23(25,26)27)20(22)21(29)31-18(13-28)14-7-6-10-16(11-14)30-15-8-4-3-5-9-15/h3-12,17-18,20H,1-2H3
50 atoms
Cl 2.768563 -5.072245 -1.627153
F  5.339216 -3.678662 -2.430889
F  5.602721 -4.943785 -0.716109
F  5.707586 -2.803668 -0.498478
O  -0.55063 0.170742 -0.622512
O  -1.202562 -1.970443 -0.717594
O  -3.327308 3.817578 2.184614
N  -1.178182 2.539711 -2.840965
C  1.024054 -2.307776 1.464744
C  1.548593 -2.760645 0.129758
C  0.904112 -1.391874 0.266004
C  -0.179688 -3.031708 2.016362
C  1.981702 -1.860366 2.543082
C  2.983159 -2.823721 -0.148893
C  -0.386957 -1.143738 -0.402154
C  3.593505 -3.756332 -0.870717
C  -1.783772 0.6001 -1.200717
C  5.066243 -3.789501 -1.125946
C  -2.748371 1.038374 -0.127394
C  -1.434319 1.692023 -2.110201
C  -2.579193 2.265279 0.503466
C  -3.766706 0.178393 0.264315
C  -3.455642 2.638536 1.512415
C  -4.620267 0.556007 1.290825
C  -4.475626 1.785392 1.912859
C  -2.989297 4.960458 1.507357
C  -2.102582 5.827915 2.129644
C  -3.550093 5.279783 0.275589
C  -1.777554 7.028098 1.512773
C  -3.206759 6.478024 -0.333762
C  -2.321309 7.356144 0.27791
H  0.935398 -3.504798 -0.364988
H  1.577492 -0.542415 0.270698
H  0.155943 -3.837035 2.67223
H  -0.79817 -2.358314 2.612737
H  -0.807093 -3.479265 1.249334
H  2.801378 -1.248938 2.167647
H  1.450643 -1.265789 3.288368
H  2.41225 -2.723633 3.053848
H  3.60197 -2.039688 0.27041
H  -2.230503 -0.192918 -1.807066
H  -1.775383 2.930835 0.209021
H  -3.895503 -0.777053 -0.227601
H  -5.416221 -0.107886 1.601349
H  -5.150804 2.087334 2.703699
H  -1.675199 5.566857 3.090498
H  -4.251264 4.609885 -0.207017
H  -1.087445 7.705046 2.000287
H  -3.642878 6.726405 -1.293459
H  -2.060438 8.28996 -0.202698
elementType: Cl F O N C H
totalener: -1928.18978903 hartree
nucrepener: 3035.57478487 hartree
electener: -4963.76457390 hartree
oneelecener: -8677.97749197 hartree
twoeener: 3714.21291807 hartree
cpcmener: -0.03181867 hartree
kineticenergy: 1921.59734431 hartree
xcener: -157.108514267022 hartree
chargesum: -0.0000000
charge: -0.070812 -0.173088 -0.173065 -0.171276 -0.279151 -0.443754 -0.328795 -0.087707 0.082974 0.022483 -0.087191 -0.269961 -0.264181 -0.142298 0.407529 -0.072045 0.408652 0.510938 0.017602 -0.229272 -0.178941 -0.180566 0.223047 -0.122480 -0.219665 0.267796 -0.242584 -0.177881 -0.123717 -0.146039 -0.182964 0.082809 0.099450 0.099417 0.101512 0.096651 0.092072 0.100429 0.102742 0.141898 0.135519 0.141788 0.145669 0.159118 0.148523 0.146719 0.155876 0.158202 0.159694 0.158326
qa: -0.0708 -0.1731 -0.1731 -0.1713 -0.2792 -0.4438 -0.3288 -0.0877 0.0830 0.0225 -0.0872 -0.2700 -0.2642 -0.1423 0.4075 -0.0720 0.4087 0.5109 0.0176 -0.2293 -0.1789 -0.1806 0.2230 -0.1225 -0.2197 0.2678 -0.2426 -0.1779 -0.1237 -0.1460 -0.1830 0.0828 0.0994 0.0994 0.1015 0.0967 0.0921 0.1004 0.1027 0.1419 0.1355 0.1418 0.1457 0.1591 0.1485 0.1467 0.1559 0.1582 0.1597 0.1583
va: 1.2625 1.1258 1.1263 1.1325 2.1337 2.0690 2.0775 3.1065 3.7505 3.8511 3.8700 3.9086 3.9108 3.8897 4.1844 3.9918 3.7304 4.4829 3.6431 4.0783 3.9744 3.9274 3.7916 3.9089 4.0129 3.7046 4.0076 3.8962 3.8883 3.8973 3.9053 1.0483 1.0332 1.0004 0.9991 1.0179 1.0067 1.0010 1.0002 1.0179 1.0215 1.0114 1.0109 0.9894 1.0043 1.0074 0.9972 0.9890 0.9901 0.9903
dispcorr: -0.024080375 hartree
energy: -1928.213869400640
dipole: -38.00732 36.99907 -1.00825 32.75581 -32.52130 0.23450 25.23197 -23.10426 2.12771
magnitude: 2.36616 au
magnitude: 6.01431 debye
