program: Gaussian 09
title: 000072794
version: EM64L-G09RevD.01
frameworkgroup: C1[X(C14H8O3)]
method: RPBEPBE
basis: SDD
operation: Freq
keyword: #pfreq=noraman
keyword: PBEPBE/SDD
title: #p freq=noraman PBEPBE/SDD
converged: YES YES NO NO
title: Mulliken charges:
elementType: O O O C C C C C C C C C C C C C C H H H H H H H H
charge: -0.240025 -0.172053 -0.172051 0.299140 0.299747 0.090014 0.089600 -0.391776 -0.391811 -0.356770 -0.356962 0.099978 0.100137 -0.234410 -0.234386 -0.228083 -0.228005 0.256046 0.256027 0.274364 0.274511 0.239083 0.239083 0.244293 0.244309
chargesum: 0.00000
title: Mulliken charges with hydrogens summed into heavy atoms:
elementType: O O O C C C C C C C C C C C C C C
charge: -0.240025 -0.172053 -0.172051 0.299140 0.299747 0.090014 0.089600 -0.135730 -0.135784 -0.082406 -0.082451 0.099978 0.100137 0.004674 0.004697 0.016210 0.016305
polarizability: 2.23758238e+02 -6.75594619e-03 1.66449911e+02 -1.10766354e-01 -5.61740522e-03 8.72000306e+01
1716.lowfreq: -0.0008 -0.0006 -0.0005 3.3278 7.5856 10.4073 58.2443 66.5753 105.2482
frequency: 58.2433 66.5645 105.2468 126.1343 141.4711 197.2277 268.0002 303.5278 309.4761 345.1474 368.7010 409.4623 419.3660 448.9598 454.2790 557.7049 563.6575 590.6317 612.9661 632.0662 664.9579 670.6189 701.4770 743.2822 772.6076 780.8886 781.2506 786.5132 811.1933 885.5051 897.4417 946.3667 965.5146 967.9709 975.6925 996.4444 1000.1346 1000.1971 1055.5816 1061.2566 1094.8749 1125.6062 1181.5008 1183.1120 1199.2196 1225.8802 1264.4457 1284.0697 1289.9762 1374.2678 1376.4981 1425.6006 1429.2748 1471.0988 1494.1145 1567.8724 1583.1724 1601.3796 1607.0629 1651.0694 1677.4138 3137.2312 3139.0548 3149.8407 3152.1871 3161.1761 3162.8047 3175.7080 3176.2417
redmass: 9.7064 6.1235 6.9778 4.1154 6.5245 4.9987 5.8067 8.7378 7.6364 5.2009 6.9819 6.2015 5.2460 4.0909 6.1523 3.2843 4.8477 6.0639 7.0887 7.2380 6.4456 5.8535 5.3422 2.2783 5.5446 1.7524 2.9569 1.6763 7.5059 1.3924 1.4664 9.1793 3.7600 1.4142 1.7759 7.1969 1.3556 1.3516 2.2454 2.1023 2.3656 1.7810 1.0652 1.0731 2.7912 2.4773 2.0220 1.4725 2.1231 10.1197 6.1656 2.2978 2.1959 2.3326 2.9217 6.6783 7.3487 5.9671 6.2158 12.7327 12.8765 1.0863 1.0860 1.0899 1.0896 1.0949 1.0948 1.1008 1.1008
irintensity: 2.4058 3.6755 1.8169 1.6118 0.1051 0.0875 1.7385 0.1549 10.3678 0.8824 2.9569 0.3021 4.4757 1.1990 0.5605 5.4925 2.3944 0.1971 0.7889 31.2453 1.0449 58.8390 10.3665 80.0675 8.4477 47.1110 2.5181 6.0503 11.9620 3.6381 0.0450 466.6427 43.9540 12.4602 15.7372 32.6912 0.0918 0.2299 0.5677 20.9681 0.0753 16.5722 1.0338 0.0372 100.3327 77.4746 30.6031 5.6451 0.2679 12.4983 0.5265 0.0306 36.4010 14.3862 0.0630 5.2656 4.2415 25.1095 10.2429 342.5420 223.9191 4.0132 1.5892 12.1886 0.1749 1.9693 13.9361 26.4442 7.9780
temp: 298.150 k
press: 1.00000 atm
elementType: 8 8 8 6 6 6 6 6 6 6 6 6 6 6 6 6 6 1 1 1 1 1 1 1 1
symmnumber: 1
zpe: 471361.5 jmol-1
zpe.correction: 0.179532 hartree
zpe.thermalcorrener: 0.192089 hartree
zpe.thermalcorrenthalpy: 0.193033 hartree
zpe.thermalcorrgfe: 0.140255 hartree
zpe.sumelectzpe: -762.822540 hartree
zpe.sumelectthermal: -762.809983 hartree
zpe.sumelectthermalent: -762.809039 hartree
zpe.sumelectthermalfe: -762.861817 hartree
dipole: -0.0114 -6.9373 -0.0068
dipole: 6.9373
quadrupole: -77.1576 -101.6772 -105.8559
quadrupole: -0.0420 9.1944 -0.0213
quadrupole: 17.7393 -6.7803 -10.9590 -0.0420 9.1944 -0.0213
hfenergy: -763.002072 hartree
pointgroup: C01 [X(C14H8O3)]
dipole: 0.0025666 2.7293287 -0.0024348 debye
dipolederiv: -1.4651703 -0.0002787 -0.6858971 0.0009666 -0.5246404 -0.0004594 -0.8540505 -0.0001481 -0.8893433 -0.5970518 0.1020437 -0.2700036 0.1121981 -0.7548797 0.3424559 -0.3520592 0.3066593 -0.708354 -0.5982677 -0.1037041 -0.2725284 -0.1133475 -0.755562 -0.3444321 -0.3496527 -0.3049051 -0.7068089 0.2485381 -0.1098017 -0.0196762 0.0970043 0.0699057 -0.0433778 -0.1030953 -0.1063149 0.0323637 0.2481209 0.1095184 -0.0195687 -0.0973504 0.0700294 0.0436459 -0.1025827 0.1057075 0.0323301 -0.1351938 -0.1638731 0.0044484 -0.1494355 -0.3527502 0.0912556 -0.0277067 0.1525462 -0.0979531 -0.1353863 0.1648537 0.0045812 0.1494478 -0.3525658 -0.0911977 -0.0274147 -0.153825 -0.0979302 -0.2275385 -0.1116195 0.0653416 -0.1333831 -0.0236037 -0.0470903 0.1101675 -0.0382735 -0.1135072 -0.227906 0.1118431 0.0655463 0.1332202 -0.02359 0.047123 0.110345 0.0385348 -0.1134258 -0.0434364 0.0680083 -0.0237393 -0.1500104 0.0633822 -0.05706 0.1012442 0.0032067 -0.1062078 -0.0433383 -0.0686574 -0.0240854 0.1498246 0.06344 0.0571366 0.1011432 -0.0035672 -0.1063072 1.2836193 0.2447048 0.6194415 0.4345946 1.2117879 -0.2597371 0.8077987 -0.4501524 1.1225391 1.2836659 -0.2434609 0.6202675 -0.4339869 1.2125597 0.2617635 0.8072821 0.4506104 1.1216622 0.0722396 0.0556663 -0.0327673 0.0440802 0.1061885 -0.091515 -0.06847 -0.0947515 -0.0841203 0.0723912 -0.0554081 -0.0329409 -0.0438939 0.1063154 0.0917071 -0.0685864 0.0948813 -0.0839128 0.084819 0.0023658 -0.0042883 0.0941906 -0.1519471 0.0019833 -0.0421731 -0.0042867 -0.140781 0.0848841 -0.0021277 -0.0044773 -0.0941066 -0.1524418 -0.0020429 -0.0424435 0.0041488 -0.1408196 0.0378546 0.0963991 -0.0338449 0.0827906 0.0101999 0.0500549 -0.0191626 0.041714 0.1218705 0.0378806 -0.0964495 -0.0338606 -0.0827022 0.0101358 -0.0501228 -0.0194352 -0.0417368 0.1218334 0.0684666 0.0296235 -0.0027579 0.0713809 0.026708 0.0399757 -0.0360676 0.0366585 0.1387093 0.0686781 -0.0295161 -0.0026501 -0.0712951 0.02699 -0.0399302 -0.0360639 -0.0366477 0.1387426 0.0435648 -0.0608438 0.0288116 -0.0867526 -0.0361602 0.0735651 0.0348175 0.0762963 0.1245683 0.04355 0.0608275 0.0289003 0.0867062 -0.0359916 -0.0736525 0.0349734 -0.076448 0.1244288 -0.1025402 -0.0213103 0.012804 -0.0109991 0.0932737 0.0248425 0.0204851 0.0192831 0.1552015 -0.1024435 0.0211968 0.0129436 0.0108586 0.0932164 -0.0248915 0.0207076 -0.0191901 0.1552215 unknown
polarizability: 223.5996437|0.0349446|166.4499308|4.6520606|0.0113669|87.3586052 unknown
InChI: InChI=1S/C14H8O3/c15-13-11-7-3-1-5-9(11)10-6-2-4-8-12(10)14(16)17-13/h1-8H
charge 0 multiplicity 1
25 atoms
O  -0.00038 -2.322155 -0.000401
O  1.603113 -2.402963 1.622225
O  -1.606895 -2.405343 -1.619513
C  0.742027 0.71523 -0.076166
C  -0.74183 0.715151 0.075086
C  1.573298 -0.394889 0.261458
C  -1.572838 -0.394965 -0.262885
C  1.381758 1.906174 -0.521633
C  -1.38181 1.905583 0.521553
C  2.987903 -0.278351 0.206012
C  -2.987464 -0.279233 -0.206277
C  1.06788 -1.717015 0.737582
C  -1.066738 -1.716186 -0.740394
C  2.783369 2.00431 -0.614561
C  -2.783422 2.003086 0.615329
C  3.596402 0.90992 -0.237758
C  -3.596226 0.908552 0.238444
H  0.764047 2.757352 -0.825346
H  -0.764265 2.756759 0.825606
H  3.59281 -1.136532 0.514812
H  -3.592192 -1.137475 -0.515277
H  3.23972 2.930613 -0.979132
H  -3.239946 2.928959 0.980773
H  4.687195 0.981432 -0.293099
H  -4.687018 0.979585 0.294463
