program: Gaussian 09
title: 000007279
version: EM64L-G09RevD.01
frameworkgroup: C1[X(C3H5Br3)]
method: RPBEPBE
basis: SDD
operation: Freq
keyword: #pfreq=noraman
keyword: PBEPBE/SDD
title: #p freq=noraman PBEPBE/SDD
converged: YES YES NO YES
title: Mulliken charges:
elementType: Br Br Br C C C H H H H H
charge: 0.048400 0.043991 0.043992 -0.349201 -0.651137 -0.651138 0.333432 0.306613 0.284215 0.306618 0.284214
chargesum: 0.00000
title: Mulliken charges with hydrogens summed into heavy atoms:
elementType: Br Br Br C C C
charge: 0.048400 0.043991 0.043992 -0.015769 -0.060309 -0.060306
polarizability: 1.05107937e+02 -5.16051557e-05 7.16387222e+01 -7.85519215e-05 -5.32715875e+00 5.26810143e+01
1716.lowfreq: -6.5795 -5.5849 -4.1283 0.0000 0.0004 0.0004 46.4025 73.1529 96.3705
frequency: 46.3969 73.1529 96.3690 170.0768 196.6308 322.0286 379.4517 515.6056 567.6019 695.1442 826.0080 904.4686 1018.7113 1047.2363 1119.8942 1120.5801 1218.0330 1250.7573 1272.9835 1307.2369 1420.6730 1434.9091 3032.9506 3040.7011 3091.3995 3125.7478 3134.3713
redmass: 10.7119 9.4911 13.5430 2.9169 6.8205 3.6665 4.2995 3.0668 6.2507 4.9022 1.4175 1.4733 5.6437 2.4003 1.0631 1.1957 1.1439 1.1979 1.2099 1.2403 1.0968 1.0877 1.0582 1.0579 1.0884 1.1079 1.1062
irintensity: 1.9774 0.0729 1.2829 0.6561 2.4731 7.5510 13.2772 12.0952 31.6151 6.2827 0.0982 40.1877 5.5676 3.4522 10.1044 2.3614 8.5066 28.8801 21.0957 22.9915 2.4835 16.2921 3.4969 22.8289 0.3099 0.3289 4.8705
temp: 298.150 k
press: 1.00000 atm
elementType: 35 35 35 6 6 6 1 1 1 1 1
symmnumber: 1
zpe: 193969.2 jmol-1
zpe.correction: 0.073879 hartree
zpe.thermalcorrener: 0.081789 hartree
zpe.thermalcorrenthalpy: 0.082733 hartree
zpe.thermalcorrgfe: 0.036911 hartree
zpe.sumelectzpe: -157.205166 hartree
zpe.sumelectthermal: -157.197256 hartree
zpe.sumelectthermalent: -157.196312 hartree
zpe.sumelectthermalfe: -157.242133 hartree
dipole: 0.0000 -2.4260 1.9448
dipole: 3.1093
quadrupole: -73.5588 -63.2755 -61.5240
quadrupole: 0.0001 0.0000 -2.1505
quadrupole: -7.4394 2.8440 4.5954 0.0001 0.0000 -2.1505
hfenergy: -157.2790445 hartree
pointgroup: C01 [X(C3H5Br3)]
dipole: 0.0000646 1.1503191 0.4161971 debye
dipolederiv: -0.1131659 -0.0000348 0.0000058 -0.000036 -0.4957606 0.0551314 0.0000117 0.1295469 -0.1120181 -0.4941685 0.013154 0.0455647 0.0656422 -0.070184 -0.027805 0.1477138 -0.0184443 -0.1317866 -0.494161 -0.0130904 -0.0455975 -0.0655733 -0.0701736 -0.0278013 -0.1477495 -0.0184222 -0.1318049 -0.0891693 0.0000763 -0.000027 0.0001034 0.7916757 -0.2870478 -0.0000171 -0.2076313 0.0275638 0.601045 -0.0106676 -0.2306634 -0.1265339 -0.0556512 0.0994727 -0.1670639 0.0740963 0.1642548 0.6010155 0.0105608 0.2307175 0.126402 -0.0556591 0.0994435 0.1671228 0.0740604 0.1642824 0.0717777 -0.0000114 0.0000077 -0.0000136 -0.0554423 0.06506 0.000004 0.0204521 -0.0291221 -0.0122207 0.0161952 0.0910568 0.039151 0.1066979 -0.0044419 0.0153381 -0.0234362 -0.0672132 -0.029367 0.0387433 0.0539075 0.0455439 -0.1011073 0.0162065 0.0314334 -0.0033965 0.0915332 -0.0122194 -0.0161711 -0.0910503 -0.0391339 0.1067063 -0.0044203 -0.0153382 -0.0234239 -0.0672179 -0.0293664 -0.0387543 -0.0539219 -0.0455519 -0.1011018 0.0162022 -0.0314551 -0.0034012 0.0915286 unknown
polarizability: 105.1079363|-0.0022602|72.9187032|0.0020478|-1.5731388|51.4010335 unknown
InChI: InChI=1S/C3H5Br3/c4-1-3(6)2-5/h3H,1-2H2
charge 0 multiplicity 1
11 atoms
Br -0.000151 -1.833251 0.457685
Br 2.938789 0.156351 -0.550021
Br -2.938668 0.156787 -0.550259
C  0.000029 0.09569 -0.167416
C  1.256113 0.814144 0.343787
C  -1.255982 0.814308 0.343731
H  0.000052 0.023228 -1.266425
H  1.412733 0.670729 1.423408
H  1.213445 1.888651 0.095677
H  -1.412717 0.670835 1.423327
H  -1.213142 1.888828 0.095706
