program: Orca
programVersion: 5.0.2
elementType: Cl F F F O O O N C C C C C C C C C C C C C C C C C C C C C C C H H H H H H H H H H H H H H H H H H H
charge: 0
multiplicity: 1
keywords: wb97x-d3
keywords: def2-TZVPP
keywords: def2/J RIJCOSX
keywords: DEFGRID2
keywords: scfconv7
keywords: smallprint printgap noloewdin
keywords: NOSOSCF
formula: C23H19ClF3NO3
InChI: InChI=1/C23H19ClF3NO3/c1-22(2)17(12-19(24)23(25,26)27)20(22)21(29)31-18(13-28)14-7-6-10-16(11-14)30-15-8-4-3-5-9-15/h3-12,17-18,20H,1-2H3
50 atoms
Cl 4.619524 -2.336695 1.039819
F  4.641827 -5.373127 0.748922
F  5.926794 -4.400831 -0.666904
F  4.120737 -5.357898 -1.341523
O  -1.653559 -1.562009 -0.185762
O  -0.096828 -0.334035 0.848296
O  -3.327486 3.770478 1.607169
N  -4.826658 -2.329209 0.231011
C  1.423377 -1.08708 -1.841935
C  2.01677 -1.80108 -0.656745
C  0.523342 -1.857623 -0.899855
C  1.454041 0.420283 -1.819969
C  1.570486 -1.661555 -3.229559
C  2.78784 -3.031905 -0.819611
C  -0.388141 -1.161523 0.022665
C  3.89602 -3.347998 -0.160114
C  -2.662153 -0.90455 0.569738
C  4.644563 -4.624355 -0.360592
C  -2.90608 0.511199 0.101855
C  -3.864804 -1.715385 0.375376
C  -2.966441 1.529569 1.038858
C  -3.068519 0.783821 -1.251514
C  -3.215029 2.830523 0.622186
C  -3.3038 2.089409 -1.652536
C  -3.387185 3.118694 -0.725239
C  -2.934408 5.068167 1.384878
C  -3.75153 6.067453 1.892281
C  -1.741671 5.379242 0.744221
C  -3.369208 7.394718 1.757629
C  -1.378594 6.711432 0.606355
C  -2.186657 7.722919 1.109147
H  2.327189 -1.14964 0.151795
H  0.131673 -2.784141 -1.303747
H  1.45337 0.838782 -0.816068
H  2.361054 0.768262 -2.316352
H  0.601438 0.831803 -2.362558
H  0.820225 -1.224931 -3.890167
H  2.552894 -1.4240 -3.64017
H  1.441841 -2.742302 -3.263243
H  2.42069 -3.750639 -1.542249
H  -2.428032 -0.918555 1.63919
H  -2.827338 1.316377 2.091877
H  -3.019588 -0.008125 -1.988139
H  -3.436789 2.313054 -2.702418
H  -3.589057 4.128117 -1.059065
H  -4.674768 5.807145 2.394246
H  -1.097103 4.599364 0.358792
H  -4.005392 8.173238 2.15755
H  -0.45089 6.956535 0.106126
H  -1.893932 8.758499 0.999773
elementType: Cl F O N C H
totalener: -1928.17584390 hartree
nucrepener: 3033.93470540 hartree
electener: -4962.11054930 hartree
oneelecener: -8674.54245839 hartree
twoeener: 3712.43190909 hartree
cpcmener: -0.04019374 hartree
kineticenergy: 1921.61322342 hartree
xcener: -157.113635542751 hartree
chargesum: -0.0000000
charge: -0.073888 -0.175224 -0.175011 -0.171040 -0.278179 -0.456919 -0.336155 -0.101375 0.086396 0.020138 -0.065757 -0.265047 -0.264406 -0.134702 0.385952 -0.077127 0.420676 0.512034 0.021865 -0.221651 -0.235929 -0.234893 0.278206 -0.138147 -0.181552 0.287601 -0.249927 -0.197932 -0.126592 -0.146252 -0.186860 0.080056 0.103607 0.094851 0.103089 0.099234 0.100762 0.103392 0.093939 0.144099 0.144446 0.139221 0.151380 0.163864 0.160964 0.149038 0.162346 0.162154 0.163367 0.161888
qa: -0.0739 -0.1752 -0.1750 -0.1710 -0.2782 -0.4569 -0.3362 -0.1014 0.0864 0.0201 -0.0658 -0.2650 -0.2644 -0.1347 0.3860 -0.0771 0.4207 0.5120 0.0219 -0.2217 -0.2359 -0.2349 0.2782 -0.1381 -0.1816 0.2876 -0.2499 -0.1979 -0.1266 -0.1463 -0.1869 0.0801 0.1036 0.0949 0.1031 0.0992 0.1008 0.1034 0.0939 0.1441 0.1444 0.1392 0.1514 0.1639 0.1610 0.1490 0.1623 0.1622 0.1634 0.1619
va: 1.2590 1.1221 1.1241 1.1324 2.1317 2.0538 2.0669 3.1099 3.7590 3.8664 3.8417 3.9061 3.9070 3.8844 4.2063 3.9850 3.7025 4.4836 3.6040 4.0867 4.0774 3.9612 3.7489 3.9096 3.9139 3.6710 4.0084 3.9134 3.8795 3.8837 3.8984 1.0495 1.0321 1.0161 1.0007 1.0007 1.0009 1.0004 1.0058 1.0167 1.0162 1.0175 1.0110 0.9893 0.9938 1.0070 0.9952 0.9878 0.9890 0.9892
dispcorr: -0.024460918 hartree
energy: -1928.200304821353
dipole: -32.60451 32.83687 0.23236 45.79659 -43.96890 1.82769 -14.22277 12.34896 -1.87381
magnitude: 2.62786 au
magnitude: 6.67948 debye
