program: Orca
programVersion: 5.0.2
elementType: Cl F F F O O O N C C C C C C C C C C C C C C C C C C C C C C C H H H H H H H H H H H H H H H H H H H
charge: 0
multiplicity: 1
keywords: wb97x-d3
keywords: def2-TZVPP
keywords: def2/J RIJCOSX
keywords: DEFGRID2
keywords: scfconv7
keywords: smallprint printgap noloewdin
keywords: NOSOSCF
formula: C23H19ClF3NO3
InChI: InChI=1/C23H19ClF3NO3/c1-22(2)17(12-19(24)23(25,26)27)20(22)21(29)31-18(13-28)14-7-6-10-16(11-14)30-15-8-4-3-5-9-15/h3-12,17-18,20H,1-2H3
50 atoms
Cl 4.68987 -2.240266 0.993399
F  4.181111 -5.338395 -1.290049
F  4.880581 -5.253831 0.743627
F  5.978998 -4.259978 -0.808141
O  -1.686801 -1.632675 -0.054129
O  -0.122989 -0.396055 0.958798
O  -3.366366 3.77956 1.494776
N  -4.86347 -2.373467 0.39161
C  1.32623 -1.165154 -1.768802
C  1.985382 -1.82909 -0.586965
C  0.487608 -1.940269 -0.775385
C  1.295055 0.34246 -1.787214
C  1.448934 -1.768336 -3.146587
C  2.795343 -3.03513 -0.759806
C  -0.419125 -1.233892 0.14556
C  3.94583 -3.299651 -0.151791
C  -2.694331 -0.942945 0.674495
C  4.743243 -4.542934 -0.381398
C  -2.934399 0.451852 0.144649
C  -3.899294 -1.757616 0.512027
C  -2.998877 1.512157 1.034356
C  -3.092289 0.662951 -1.220187
C  -3.247561 2.792298 0.557046
C  -3.328304 1.94837 -1.681737
C  -3.416185 3.018446 -0.802664
C  -2.936227 5.055845 1.222972
C  -3.724753 6.096583 1.691404
C  -1.73686 5.309351 0.569453
C  -3.306521 7.406521 1.504239
C  -1.337872 6.624725 0.378958
C  -2.116813 7.676946 0.84236
H  2.30427 -1.148305 0.193716
H  0.109452 -2.88838 -1.140298
H  0.405238 0.70202 -2.307481
H  1.312348 0.789279 -0.795542
H  2.16731 0.714746 -2.32663
H  1.365528 -2.853859 -3.149543
H  0.658328 -1.380512 -3.790548
H  2.405874 -1.500439 -3.597183
H  2.423506 -3.780679 -1.452289
H  -2.46156 -0.911831 1.743889
H  -2.864178 1.347731 2.096718
H  -3.041083 -0.161547 -1.919857
H  -3.459519 2.123188 -2.741142
H  -3.619119 4.011546 -1.182098
H  -4.654443 5.882305 2.202981
H  -1.113859 4.498258 0.214356
H  -3.920626 8.217346 1.873309
H  -0.404509 6.824109 -0.131024
H  -1.79606 8.699037 0.692305
elementType: Cl F O N C H
totalener: -1928.17580015 hartree
nucrepener: 3036.86038125 hartree
electener: -4965.03618140 hartree
oneelecener: -8680.33017292 hartree
twoeener: 3715.29399152 hartree
cpcmener: -0.04018110 hartree
kineticenergy: 1921.59375542 hartree
xcener: -157.109974839716 hartree
chargesum: 0.0000000
charge: -0.074070 -0.171098 -0.175033 -0.174994 -0.277236 -0.455122 -0.336618 -0.101710 0.090042 0.019126 -0.064641 -0.266744 -0.264552 -0.137339 0.379831 -0.077528 0.420392 0.512229 0.027098 -0.221524 -0.237625 -0.239504 0.276251 -0.135091 -0.179624 0.289725 -0.251913 -0.197583 -0.125429 -0.147266 -0.188189 0.080481 0.104190 0.099172 0.095627 0.103894 0.093841 0.100678 0.103531 0.144887 0.144854 0.139668 0.151358 0.163719 0.161730 0.148655 0.162316 0.162087 0.163139 0.161913
qa: -0.0741 -0.1711 -0.1750 -0.1750 -0.2772 -0.4551 -0.3366 -0.1017 0.0900 0.0191 -0.0646 -0.2667 -0.2646 -0.1373 0.3798 -0.0775 0.4204 0.5122 0.0271 -0.2215 -0.2376 -0.2395 0.2763 -0.1351 -0.1796 0.2897 -0.2519 -0.1976 -0.1254 -0.1473 -0.1882 0.0805 0.1042 0.0992 0.0956 0.1039 0.0938 0.1007 0.1035 0.1449 0.1449 0.1397 0.1514 0.1637 0.1617 0.1487 0.1623 0.1621 0.1631 0.1619
va: 1.2589 1.1324 1.1231 1.1232 2.1304 2.0544 2.0663 3.1098 3.7584 3.8717 3.8380 3.9053 3.9059 3.8804 4.2185 3.9838 3.6997 4.4833 3.5968 4.0873 4.0819 3.9572 3.7476 3.9040 3.9158 3.6712 4.0076 3.9088 3.8790 3.8852 3.8990 1.0487 1.0317 1.0005 1.0156 1.0009 1.0060 1.0010 1.0004 1.0162 1.0162 1.0173 1.0112 0.9893 0.9933 1.0073 0.9954 0.9878 0.9892 0.9892
dispcorr: -0.024652171 hartree
energy: -1928.200452316151
dipole: -33.90252 34.05988 0.15736 44.42040 -42.69027 1.73013 -14.36100 12.45869 -1.90231
magnitude: 2.57622 au
magnitude: 6.54823 debye
