program: Gaussian 09
title: 000072792
version: EM64L-G09RevD.01
frameworkgroup: C1[X(C14H12N2)]
method: RPBEPBE
basis: SDD
operation: Freq
keyword: #pfreq=noraman
keyword: PBEPBE/SDD
title: #p freq=noraman PBEPBE/SDD
converged: NO NO NO NO
title: Mulliken charges:
elementType: N N C C C C C C C C C C C C C C H H H H H H H H H H H H
charge: 0.053962 0.053969 0.287069 0.287079 -0.152461 -0.152478 0.354842 0.354807 -0.429205 -0.429217 -0.346163 -0.346158 -0.811772 -0.811747 -0.373147 -0.373146 0.239275 0.239275 0.229482 0.229483 0.236728 0.236729 0.233267 0.233263 0.236724 0.236728 0.241406 0.241408
chargesum: 0.00000
title: Mulliken charges with hydrogens summed into heavy atoms:
elementType: N N C C C C C C C C C C C C C C
charge: 0.053962 0.053969 0.287069 0.287079 -0.152461 -0.152478 0.354842 0.354807 -0.189929 -0.189942 -0.116681 -0.116675 -0.105049 -0.105032 -0.131742 -0.131738
polarizability: 2.67450134e+02 -5.71073998e-04 1.80035483e+02 6.65641101e-03 -1.13541982e-04 7.29500436e+01
1716.lowfreq: -3.9916 -0.0004 -0.0003 0.0005 2.8675 19.4884 70.2564 76.2385 167.1403
frequency: 70.2165 76.2273 167.1381 168.4612 182.0272 187.0683 215.3850 242.3808 262.4558 300.9995 305.9325 448.4197 449.1743 451.1343 484.2769 490.1160 512.2031 532.2017 562.6480 608.5153 621.0950 621.6539 687.3384 747.0380 818.8534 823.0914 827.5955 844.2548 856.1482 861.3944 872.7602 913.4369 960.4656 962.5982 974.1993 1001.6616 1002.2467 1046.2977 1046.6039 1067.8382 1089.6896 1160.7680 1167.8931 1205.9565 1227.1132 1248.9071 1263.9619 1304.5454 1338.9873 1340.3742 1369.4756 1377.6887 1401.4712 1401.9025 1410.8971 1434.9566 1471.9324 1472.9271 1472.9664 1473.7762 1497.6909 1499.5851 1538.7129 1571.1146 1589.3074 1613.3562 2975.9281 2976.1294 3054.1730 3054.2403 3087.1585 3087.3768 3114.7162 3115.1648 3131.6472 3146.3098 3146.6422 3156.0097
redmass: 4.1409 4.0206 1.0972 1.2633 2.5001 3.7957 3.1563 4.5951 3.2204 3.0234 4.7690 3.9354 3.3606 5.5918 3.2062 6.3010 5.5363 3.8900 4.7992 3.2780 4.5320 6.4286 6.3998 2.6102 6.0837 1.6164 4.6601 1.7405 1.3811 2.7575 5.9009 3.7940 1.4299 1.4409 1.3261 1.9634 1.6321 1.5663 1.5672 1.8783 1.8028 4.2744 1.6471 1.9756 1.9985 2.5598 2.0722 4.1426 7.9378 2.5977 1.8958 3.0426 1.2244 1.2315 2.0845 3.6619 1.1689 1.0454 1.0455 1.1583 4.1122 3.2209 6.0688 5.8998 6.5774 6.6918 1.0376 1.0376 1.0975 1.0975 1.0986 1.0986 1.0885 1.0886 1.0857 1.0961 1.0962 1.0968
irintensity: 0.0000 2.7974 0.0001 0.4157 6.0915 2.8658 0.0000 0.0000 3.2703 0.3728 0.7922 0.8900 0.0000 0.8552 1.8154 1.2329 10.2324 5.6347 0.4522 0.0000 0.0000 0.0484 0.2488 14.8673 6.8504 0.0228 0.2438 0.0000 91.0600 0.0000 15.2714 1.5779 0.0495 0.0000 0.0000 1.6571 1.8242 0.0004 14.1166 1.9210 0.5434 0.0195 2.2219 0.0046 3.8438 2.6074 2.0571 2.1208 0.3505 0.9061 0.5119 1.3180 8.3011 27.7857 35.1660 0.8553 0.4957 29.9480 0.1686 51.0066 44.5403 3.7604 28.3820 37.2401 0.0777 11.8730 22.1064 29.4618 5.9055 26.4440 41.7417 2.1391 5.4634 29.7485 0.0608 70.4940 11.6442 21.9069
temp: 298.150 k
press: 1.00000 atm
elementType: 7 7 6 6 6 6 6 6 6 6 6 6 6 6 6 6 1 1 1 1 1 1 1 1 1 1 1 1
symmnumber: 1
zpe: 581773.9 jmol-1
zpe.correction: 0.221586 hartree
zpe.thermalcorrener: 0.234301 hartree
zpe.thermalcorrenthalpy: 0.235245 hartree
zpe.thermalcorrgfe: 0.182991 hartree
zpe.sumelectzpe: -649.107512 hartree
zpe.sumelectthermal: -649.094797 hartree
zpe.sumelectthermalent: -649.093853 hartree
zpe.sumelectthermalfe: -649.146108 hartree
dipole: -0.0001 4.8110 0.0000
dipole: 4.8110
quadrupole: -67.7073 -93.0072 -97.2778
quadrupole: -0.0003 0.0007 0.0000
quadrupole: 18.2901 -7.0098 -11.2804 -0.0003 0.0007 0.0000
hfenergy: -649.3290984 hartree
pointgroup: C01 [X(C14H12N2)]
dipole: 0.0000162 -1.8927898 -0.0000082 debye
polarizability: 267.4501343|-0.0010092|180.0354827|-0.0066564|0.0001136|72.9500436 unknown
InChI: InChI=1S/C14H12N2/c1-9-5-7-15-13-11(9)3-4-12-10(2)6-8-16-14(12)13/h3-8H,1-2H3
charge 0 multiplicity 1
28 atoms
N  1.386375 1.863865 -0.000026
N  -1.38636 1.863866 0.000091
C  1.442179 -0.614375 -0.000035
C  -1.442206 -0.614378 0.000092
C  0.733211 0.650458 -0.000008
C  -0.733212 0.650473 0.00006
C  2.882232 -0.596814 -0.000084
C  -2.882229 -0.596777 0.000165
C  0.6923 -1.846035 -0.000021
C  -0.692329 -1.846035 0.000043
C  3.518341 0.655917 -0.000066
C  -3.51834 0.655962 0.000143
C  3.69351 -1.878605 -0.000131
C  -3.693556 -1.878568 0.000203
C  2.736609 1.846312 -0.000056
C  -2.736601 1.846342 0.000107
H  1.227253 -2.801611 -0.000059
H  -1.227291 -2.801609 0.000055
H  4.611765 0.722526 -0.000057
H  -4.611761 0.722546 0.000132
H  3.476793 -2.49821 0.89063
H  3.476795 -2.498094 -0.890975
H  4.773668 -1.654382 -0.00011
H  -4.773699 -1.654289 0.000146
H  -3.476823 -2.498166 -0.890556
H  -3.476862 -2.498017 0.891072
H  3.223935 2.829327 -0.000044
H  -3.223896 2.829371 0.000089
