program: Orca
programVersion: 5.0.2
elementType: Cl F F F O O O N C C C C C C C C C C C C C C C C C C C C C C C H H H H H H H H H H H H H H H H H H H
charge: 0
multiplicity: 1
keywords: wb97x-d3
keywords: def2-TZVPP
keywords: def2/J RIJCOSX
keywords: DEFGRID2
keywords: scfconv7
keywords: smallprint printgap noloewdin
keywords: NOSOSCF
formula: C23H19ClF3NO3
InChI: InChI=1/C23H19ClF3NO3/c1-22(2)17(12-19(24)23(25,26)27)20(22)21(29)31-18(13-28)14-7-6-10-16(11-14)30-15-8-4-3-5-9-15/h3-12,17-18,20H,1-2H3
50 atoms
Cl 1.246266 -0.286035 -0.967898
F  4.181656 0.141433 -1.26574
F  4.785269 -0.998977 0.457383
F  3.571849 0.76273 0.695242
O  -1.899815 -1.367144 0.479393
O  -1.806551 -3.251973 -0.709111
O  -1.660899 3.683507 0.734956
N  -2.583224 -0.815008 -2.824647
C  0.601482 -4.054786 1.134137
C  1.14901 -3.15779 0.082518
C  -0.074224 -2.720845 0.873432
C  -0.038845 -5.355883 0.718272
C  1.318793 -4.142352 2.459973
C  2.399423 -2.384146 0.236235
C  -1.329431 -2.533651 0.134778
C  2.534736 -1.1377 -0.196421
C  -3.035411 -0.931171 -0.246932
C  3.777017 -0.311327 -0.074493
C  -3.354345 0.476391 0.194821
C  -2.758492 -0.906802 -1.691209
C  -2.323196 1.406741 0.271035
C  -4.662413 0.839699 0.468481
C  -2.617488 2.716523 0.613508
C  -4.939272 2.155739 0.81966
C  -3.927624 3.096929 0.889227
C  -0.451591 3.536369 0.090298
C  0.700925 3.64944 0.850523
C  -0.38546 3.340355 -1.283429
C  1.938645 3.568645 0.225649
C  0.857226 3.246289 -1.892084
C  2.021562 3.358169 -1.142918
H  0.939405 -3.456097 -0.942127
H  0.111522 -1.963622 1.625938
H  0.709793 -6.149273 0.752802
H  -0.842205 -5.630261 1.403172
H  -0.443898 -5.334754 -0.290643
H  1.745228 -3.187858 2.771143
H  0.63017 -4.467585 3.240805
H  2.128904 -4.871985 2.406058
H  3.247449 -2.869448 0.706812
H  -3.891689 -1.592147 -0.080685
H  -1.303721 1.107875 0.063271
H  -5.458224 0.109109 0.405742
H  -5.956564 2.452782 1.035593
H  -4.14766 4.122304 1.156824
H  0.631831 3.804775 1.919422
H  -1.289395 3.260013 -1.874067
H  2.838855 3.665858 0.817375
H  0.912468 3.087511 -2.961134
H  2.987086 3.284274 -1.625226
elementType: Cl F O N C H
totalener: -1928.17092773 hartree
nucrepener: 3359.96457556 hartree
electener: -5288.13550329 hartree
oneelecener: -9328.00911345 hartree
twoeener: 4039.87361016 hartree
cpcmener: -0.03983853 hartree
kineticenergy: 1921.60503620 hartree
xcener: -157.113504232972 hartree
chargesum: -0.0000000
charge: -0.071519 -0.178646 -0.169255 -0.172044 -0.274908 -0.461943 -0.336111 -0.100632 0.153879 -0.058123 -0.141100 -0.281265 -0.279048 -0.127509 0.409521 -0.029562 0.432132 0.517501 0.003606 -0.237210 -0.179905 -0.216818 0.269401 -0.104730 -0.247400 0.287889 -0.231977 -0.193934 -0.127458 -0.144923 -0.186564 0.124710 0.114882 0.096425 0.103651 0.094191 0.095312 0.100096 0.103491 0.154463 0.138739 0.109374 0.149832 0.161807 0.149086 0.148197 0.158192 0.157980 0.160136 0.158090
qa: -0.0715 -0.1786 -0.1693 -0.1720 -0.2749 -0.4619 -0.3361 -0.1006 0.1539 -0.0581 -0.1411 -0.2813 -0.2790 -0.1275 0.4095 -0.0296 0.4321 0.5175 0.0036 -0.2372 -0.1799 -0.2168 0.2694 -0.1047 -0.2474 0.2879 -0.2320 -0.1939 -0.1275 -0.1449 -0.1866 0.1247 0.1149 0.0964 0.1037 0.0942 0.0953 0.1001 0.1035 0.1545 0.1387 0.1094 0.1498 0.1618 0.1491 0.1482 0.1582 0.1580 0.1601 0.1581
va: 1.2818 1.1231 1.1380 1.1209 2.1514 2.0347 2.0754 3.1068 3.7226 3.8918 3.8578 3.8855 3.9154 3.8533 4.1375 3.9426 3.7439 4.4529 3.7230 4.0319 3.9301 3.9594 3.7700 3.8940 3.9982 3.6571 4.0116 3.9108 3.8347 3.8398 3.8532 1.0202 1.0245 1.0010 0.9986 1.0185 1.0001 1.0027 0.9995 1.0037 1.0131 1.0491 1.0022 0.9878 1.0061 1.0060 0.9957 0.9923 0.9900 0.9927
dispcorr: -0.029656963 hartree
energy: -1928.200584694583
dipole: -19.51262 19.58327 0.07065 -13.02694 11.94292 -1.08402 11.73048 -9.17772 2.55276
magnitude: 2.77429 au
magnitude: 7.05168 debye
