program: Orca
programVersion: 5.0.2
elementType: Cl F F F O O O N C C C C C C C C C C C C C C C C C C C C C C C H H H H H H H H H H H H H H H H H H H
charge: 0
multiplicity: 1
keywords: wb97x-d3
keywords: def2-TZVPP
keywords: def2/J RIJCOSX
keywords: DEFGRID2
keywords: scfconv7
keywords: smallprint printgap noloewdin
keywords: NOSOSCF
formula: C23H19ClF3NO3
InChI: InChI=1/C23H19ClF3NO3/c1-22(2)17(12-19(24)23(25,26)27)20(22)21(29)31-18(13-28)14-7-6-10-16(11-14)30-15-8-4-3-5-9-15/h3-12,17-18,20H,1-2H3
50 atoms
Cl 1.232318 -0.273068 -1.038109
F  4.811341 -1.036313 0.248416
F  3.629577 0.734653 0.565918
F  4.14876 0.139839 -1.428063
O  -1.884727 -1.373596 0.446213
O  -1.804535 -3.226264 -0.792745
O  -1.694674 3.67027 0.887482
N  -2.559373 -0.702916 -2.834648
C  0.620844 -4.078121 1.010691
C  1.152217 -3.162276 -0.033166
C  -0.056232 -2.738575 0.787606
C  -0.032528 -5.368893 0.582372
C  1.361617 -4.191502 2.321458
C  2.407059 -2.393094 0.106591
C  -1.319228 -2.532061 0.066193
C  2.536575 -1.142126 -0.314696
C  -3.023005 -0.919221 -0.265911
C  3.789912 -0.328682 -0.228804
C  -3.354297 0.46727 0.229036
C  -2.741608 -0.838362 -1.706578
C  -2.332276 1.404694 0.337951
C  -4.665428 0.805536 0.518987
C  -2.639021 2.696924 0.732446
C  -4.954921 2.103936 0.921399
C  -3.952585 3.051692 1.026218
C  -0.474756 3.546116 0.257407
C  0.666551 3.603482 1.040549
C  -0.390119 3.423968 -1.12342
C  1.912894 3.541077 0.430618
C  0.860644 3.348199 -1.717849
C  2.014396 3.404783 -0.946097
H  0.921902 -3.440243 -1.059055
H  0.141936 -1.995878 1.55151
H  0.707704 -6.169988 0.60515
H  -0.83558 -5.645127 1.26696
H  -0.440468 -5.333051 -0.424319
H  1.795747 -3.244103 2.64246
H  0.686862 -4.52972 3.109064
H  2.169014 -4.920808 2.240549
H  3.26444 -2.886644 0.549975
H  -3.874133 -1.592354 -0.126288
H  -1.310707 1.125089 0.113408
H  -5.453535 0.069318 0.429046
H  -5.975033 2.381616 1.149632
H  -4.181378 4.063723 1.334818
H  0.581689 3.70146 2.115348
H  -1.287051 3.384997 -1.728926
H  2.805146 3.594511 1.040032
H  0.930876 3.247074 -2.792808
H  2.986412 3.346659 -1.417401
elementType: Cl F O N C H
totalener: -1928.17111614 hartree
nucrepener: 3357.54370124 hartree
electener: -5285.71481738 hartree
oneelecener: -9323.17438196 hartree
twoeener: 4037.45956458 hartree
cpcmener: -0.03980162 hartree
kineticenergy: 1921.60925575 hartree
xcener: -157.113978097528 hartree
chargesum: -0.0000000
charge: -0.072651 -0.169317 -0.171179 -0.178557 -0.274931 -0.461324 -0.336024 -0.100192 0.153800 -0.061254 -0.134949 -0.280715 -0.279214 -0.127570 0.405413 -0.028358 0.433458 0.516650 0.002085 -0.237784 -0.179287 -0.216571 0.269140 -0.104936 -0.247128 0.281865 -0.226936 -0.190922 -0.128469 -0.146620 -0.185115 0.124209 0.114655 0.096181 0.103963 0.094100 0.095226 0.100144 0.103517 0.154469 0.138059 0.109960 0.149725 0.161340 0.148870 0.148254 0.158163 0.158160 0.160467 0.158132
qa: -0.0727 -0.1693 -0.1712 -0.1786 -0.2749 -0.4613 -0.3360 -0.1002 0.1538 -0.0613 -0.1349 -0.2807 -0.2792 -0.1276 0.4054 -0.0284 0.4335 0.5166 0.0021 -0.2378 -0.1793 -0.2166 0.2691 -0.1049 -0.2471 0.2819 -0.2269 -0.1909 -0.1285 -0.1466 -0.1851 0.1242 0.1147 0.0962 0.1040 0.0941 0.0952 0.1001 0.1035 0.1545 0.1381 0.1100 0.1497 0.1613 0.1489 0.1483 0.1582 0.1582 0.1605 0.1581
va: 1.2804 1.1378 1.1217 1.1234 2.1514 2.0351 2.0750 3.1065 3.7232 3.8917 3.8529 3.8852 3.9164 3.8533 4.1409 3.9411 3.7424 4.4558 3.7260 4.0308 3.9286 3.9593 3.7710 3.8954 3.9976 3.6618 4.0098 3.9131 3.8427 3.8416 3.8526 1.0208 1.0245 1.0011 0.9985 1.0182 1.0002 1.0026 0.9995 1.0040 1.0139 1.0479 1.0022 0.9880 1.0063 1.0056 0.9957 0.9919 0.9899 0.9931
dispcorr: -0.029590563 hartree
energy: -1928.200706699962
dipole: -19.47576 19.57050 0.09474 -13.18428 12.02037 -1.16391 12.52164 -9.97325 2.54839
magnitude: 2.80320 au
magnitude: 7.12517 debye
