program: Orca
programVersion: 5.0.2
elementType: Cl F F F O O O N C C C C C C C C C C C C C C C C C C C C C C C H H H H H H H H H H H H H H H H H H H
charge: 0
multiplicity: 1
keywords: wb97x-d3
keywords: def2-TZVPP
keywords: def2/J RIJCOSX
keywords: DEFGRID2
keywords: scfconv7
keywords: smallprint printgap noloewdin
keywords: NOSOSCF
formula: C23H19ClF3NO3
InChI: InChI=1/C23H19ClF3NO3/c1-22(2)17(12-19(24)23(25,26)27)20(22)21(29)31-18(13-28)14-7-6-10-16(11-14)30-15-8-4-3-5-9-15/h3-12,17-18,20H,1-2H3
50 atoms
Cl 1.770177 0.214862 -1.085425
F  4.636894 -0.129484 -0.2224
F  4.193427 -1.174039 1.608513
F  3.47434 0.832736 1.307152
O  -2.280657 -2.267899 -0.242941
O  -2.359918 -2.382236 1.983136
O  -0.937961 2.569887 -1.145927
N  -4.44188 -1.628315 -2.654245
C  0.244491 -3.980911 -0.149749
C  0.606431 -2.526582 -0.106103
C  -0.389522 -3.102252 0.901952
C  -0.528056 -4.473411 -1.349754
C  1.214977 -5.010173 0.381017
C  1.868915 -2.020601 0.426057
C  -1.761785 -2.572843 0.952375
C  2.433536 -0.867203 0.087132
C  -3.457221 -1.465323 -0.240152
C  3.689497 -0.340571 0.698418
C  -3.127141 -0.031774 0.099609
C  -3.994385 -1.567511 -1.596757
C  -2.160262 0.633003 -0.646584
C  -3.746251 0.59618 1.168977
C  -1.832966 1.939632 -0.327004
C  -3.405031 1.906418 1.47877
C  -2.453953 2.586714 0.736486
C  0.034293 3.385132 -0.623911
C  0.399813 4.483537 -1.390027
C  0.682533 3.105007 0.572663
C  1.429138 5.306576 -0.956245
C  1.702941 3.943822 0.998559
C  2.081987 5.044355 0.240414
H  0.159363 -1.929834 -0.891846
H  0.001792 -3.252699 1.90135
H  -1.083024 -3.691455 -1.861907
H  0.169882 -4.900854 -2.071594
H  -1.228025 -5.259715 -1.063026
H  1.9817 -5.228233 -0.363764
H  1.713029 -4.696987 1.297568
H  0.687997 -5.939988 0.599141
H  2.366828 -2.616856 1.180888
H  -4.213975 -1.861524 0.443403
H  -1.667593 0.149652 -1.482435
H  -4.489115 0.070985 1.754899
H  -3.887285 2.405773 2.308178
H  -2.206809 3.611742 0.981741
H  -0.112173 4.685906 -2.322405
H  0.410022 2.241519 1.165995
H  1.715701 6.159429 -1.557981
H  2.208992 3.726851 1.930261
H  2.882167 5.689289 0.578056
elementType: Cl F O N C H
totalener: -1928.17265644 hartree
nucrepener: 3333.45135293 hartree
electener: -5261.62400936 hartree
oneelecener: -9273.99834169 hartree
twoeener: 4012.37433233 hartree
cpcmener: -0.03998751 hartree
kineticenergy: 1921.61320521 hartree
xcener: -157.115489588180 hartree
chargesum: -0.0000000
charge: -0.077963 -0.175172 -0.171131 -0.171495 -0.279760 -0.459330 -0.332996 -0.098498 0.087906 0.009566 -0.047612 -0.256728 -0.277282 -0.138066 0.392971 -0.054968 0.409180 0.505925 0.011136 -0.229157 -0.242688 -0.189273 0.243491 -0.126026 -0.175961 0.321034 -0.266884 -0.221593 -0.124274 -0.148016 -0.188835 0.091921 0.100572 0.091475 0.096486 0.103324 0.103245 0.095344 0.101168 0.143868 0.142907 0.142781 0.151193 0.163550 0.160039 0.147965 0.153996 0.160765 0.160865 0.161037
qa: -0.0780 -0.1752 -0.1711 -0.1715 -0.2798 -0.4593 -0.3330 -0.0985 0.0879 0.0096 -0.0476 -0.2567 -0.2773 -0.1381 0.3930 -0.0550 0.4092 0.5059 0.0111 -0.2292 -0.2427 -0.1893 0.2435 -0.1260 -0.1760 0.3210 -0.2669 -0.2216 -0.1243 -0.1480 -0.1888 0.0919 0.1006 0.0915 0.0965 0.1033 0.1032 0.0953 0.1012 0.1439 0.1429 0.1428 0.1512 0.1635 0.1600 0.1480 0.1540 0.1608 0.1609 0.1610
va: 1.2591 1.1251 1.1327 1.1210 2.1309 2.0459 2.0452 3.1056 3.7861 3.8418 3.8340 3.8993 3.9198 3.8921 4.1851 3.9520 3.7483 4.4776 3.6256 4.0769 4.0299 3.9631 3.7902 3.8908 3.9268 3.5747 4.0227 3.8763 3.8818 3.8878 3.9029 1.0278 1.0278 1.0120 1.0000 1.0004 0.9999 1.0058 0.9999 1.0185 1.0139 1.0246 1.0030 0.9889 0.9940 1.0080 1.0046 0.9880 0.9916 0.9888
dispcorr: -0.029083096 hartree
energy: -1928.201739531398
dipole: -18.63958 19.15490 0.51532 -9.61360 8.68606 -0.92754 1.20825 0.20435 1.41261
magnitude: 1.76673 au
magnitude: 4.49068 debye
