program: Orca
programVersion: 5.0.2
elementType: Cl F F F O O O N C C C C C C C C C C C C C C C C C C C C C C C H H H H H H H H H H H H H H H H H H H
charge: 0
multiplicity: 1
keywords: wb97x-d3
keywords: def2-TZVPP
keywords: def2/J RIJCOSX
keywords: DEFGRID2
keywords: scfconv7
keywords: smallprint printgap noloewdin
keywords: NOSOSCF
formula: C23H19ClF3NO3
InChI: InChI=1/C23H19ClF3NO3/c1-22(2)17(12-19(24)23(25,26)27)20(22)21(29)31-18(13-28)14-7-6-10-16(11-14)30-15-8-4-3-5-9-15/h3-12,17-18,20H,1-2H3
50 atoms
Cl 2.862141 0.69953 1.052962
F  4.819155 -2.646486 1.246109
F  4.654158 -1.061727 2.69186
F  5.537574 -0.673955 0.775116
O  -1.724436 -1.295625 0.157675
O  -2.129143 -3.427951 -0.346287
O  -2.165647 3.720167 -0.148122
N  -4.53313 -1.398019 -1.762678
C  0.726292 -1.933002 -1.721497
C  1.084707 -1.50487 -0.318918
C  0.093036 -2.62581 -0.535117
C  -0.065782 -0.960483 -2.559156
C  1.694447 -2.757497 -2.532657
C  2.392115 -1.83505 0.251736
C  -1.348071 -2.514412 -0.237637
C  3.217086 -0.980244 0.84365
C  -3.105134 -1.062577 0.405077
C  4.558074 -1.348353 1.390027
C  -3.228312 0.364544 0.873212
C  -3.887697 -1.271802 -0.81906
C  -2.673465 1.372537 0.09232
C  -3.849392 0.655191 2.075919
C  -2.709819 2.679899 0.548482
C  -3.90871 1.977085 2.5024
C  -3.334161 2.988754 1.754024
C  -1.247119 3.438054 -1.139061
C  -1.562316 3.780228 -2.442717
C  -0.028659 2.850858 -0.823504
C  -0.638706 3.530438 -3.450142
C  0.879836 2.597546 -1.839665
C  0.577862 2.933091 -3.154114
H  0.672916 -0.545796 -0.027621
H  0.458266 -3.631905 -0.360801
H  -0.72425 -1.492583 -3.247204
H  -0.671728 -0.273364 -1.971953
H  0.617592 -0.357193 -3.158245
H  2.436966 -2.114963 -3.007844
H  2.222614 -3.503475 -1.940695
H  1.159922 -3.287393 -3.322181
H  2.718229 -2.865089 0.174335
H  -3.488212 -1.748342 1.166215
H  -2.212851 1.13006 -0.857636
H  -4.274682 -0.137094 2.677887
H  -4.391875 2.218166 3.439593
H  -3.363844 4.014301 2.099253
H  -2.517222 4.237378 -2.668695
H  0.203867 2.588006 0.20112
H  -0.879691 3.797164 -4.47062
H  1.828798 2.1343 -1.602767
H  1.290524 2.731525 -3.942556
elementType: Cl F O N C H
totalener: -1928.17476341 hartree
nucrepener: 3281.67595451 hartree
electener: -5209.85071792 hartree
oneelecener: -9169.30856531 hartree
twoeener: 3959.45784738 hartree
cpcmener: -0.04253481 hartree
kineticenergy: 1921.61411935 hartree
xcener: -157.115160915040 hartree
chargesum: -0.0000000
charge: -0.082800 -0.170993 -0.174826 -0.175519 -0.261045 -0.457644 -0.338438 -0.095318 0.120745 0.072500 -0.124773 -0.273364 -0.261047 -0.155688 0.427540 -0.062862 0.385892 0.507448 -0.002416 -0.224148 -0.230130 -0.208902 0.270560 -0.107496 -0.236504 0.262138 -0.219369 -0.167514 -0.127364 -0.142079 -0.185228 0.072808 0.106656 0.114783 0.051766 0.104423 0.101708 0.091921 0.101362 0.147689 0.137366 0.175512 0.150324 0.162035 0.149355 0.149337 0.153244 0.161555 0.143939 0.162861
qa: -0.0828 -0.1710 -0.1748 -0.1755 -0.2610 -0.4576 -0.3384 -0.0953 0.1207 0.0725 -0.1248 -0.2734 -0.2610 -0.1557 0.4275 -0.0629 0.3859 0.5074 -0.0024 -0.2241 -0.2301 -0.2089 0.2706 -0.1075 -0.2365 0.2621 -0.2194 -0.1675 -0.1274 -0.1421 -0.1852 0.0728 0.1067 0.1148 0.0518 0.1044 0.1017 0.0919 0.1014 0.1477 0.1374 0.1755 0.1503 0.1620 0.1494 0.1493 0.1532 0.1616 0.1439 0.1629
va: 1.2571 1.1330 1.1263 1.1224 2.1725 2.0406 2.0771 3.1065 3.7197 3.8094 3.9344 3.9411 3.9081 3.8538 4.1590 3.9462 3.7834 4.4901 3.7269 4.0235 3.9171 3.9493 3.7729 3.8954 4.0066 3.7311 4.0002 3.8786 3.8721 3.8049 3.9043 1.0308 1.0289 1.0063 1.0065 0.9983 1.0014 1.0053 1.0007 1.0128 1.0157 0.9836 1.0008 0.9878 1.0058 1.0047 0.9992 0.9874 1.0082 0.9894
dispcorr: -0.029701695 hartree
energy: -1928.204465104876
dipole: -26.87896 27.70149 0.82253 4.79144 -4.50768 0.28376 -23.66638 24.01747 0.35109
magnitude: 0.93826 au
magnitude: 2.38487 debye
