program: Gaussian 09
title: 000060399
version: EM64L-G09RevD.01
frameworkgroup: C1[X(C14H21NO3)]
method: RPBEPBE
basis: SDD
operation: Freq
keyword: #p
keyword: freq=noraman
keyword: PBEPBE/SDD
title: #p freq=noraman PBEPBE/SDD
converged: YES YES NO NO
title: Mulliken charges:
elementType: O O O N C C C C C C C C C C C C C C H H H H H H H H H H H H H H H H H H H H H
charge: -0.472695 -0.494395 -0.434644 -0.416859 0.014960 -0.401691 -0.457770 -0.394342 -0.396302 -0.388288 -0.444262 -0.202969 0.523887 -0.581149 -0.401806 0.182990 -0.309777 0.131841 0.188097 0.199839 0.204698 0.185663 0.209422 0.203888 0.192061 0.194480 0.202468 0.200331 0.193814 0.264183 0.238539 0.217506 0.191533 0.222762 0.358249 0.278491 0.247749 0.368879 0.380618
chargesum: 0.00000
title: Mulliken charges with hydrogens summed into heavy atoms:
elementType: O O O N C C C C C C C C C C C C C C
charge: -0.114446 -0.125516 -0.054026 -0.152676 0.203057 0.002845 -0.062685 0.001607 0.000645 0.005857 0.011784 -0.011436 0.523887 -0.358387 -0.123315 0.182990 -0.062028 0.131841
polarizability: 2.26109750e+02 -5.18387924e+00 1.60673568e+02 1.82295174e+01 9.35976706e+00 1.21668490e+02
1716.lowfreq: -8.4685 -3.5218 0.0003 0.0007 0.0007 4.0744 16.9851 20.3571 32.0217
frequency: 15.2639 19.3091 31.8852 46.5655 83.7152 136.3330 151.0092 175.6681 204.2852 215.4214 222.7260 233.8730 264.6678 278.1825 316.1518 330.8955 353.2633 393.0615 414.0485 424.9410 438.1600 446.2541 463.5596 476.8974 499.7286 558.5201 580.4994 598.2511 617.4815 658.5665 712.9174 753.1801 765.1143 772.8120 785.9111 787.4769 831.8608 837.0324 843.4624 863.0152 881.0708 890.6555 918.5819 929.8653 959.4837 962.0238 1019.4625 1034.1814 1047.6523 1051.8804 1057.4447 1072.9571 1089.5252 1111.4587 1122.0066 1127.4240 1147.4319 1154.8864 1169.1351 1179.1404 1218.8390 1223.0915 1241.6246 1255.7281 1257.4810 1258.9381 1277.1312 1294.7903 1304.0062 1310.9256 1325.8078 1330.1902 1334.0058 1339.8936 1341.6976 1347.9210 1368.2731 1397.8971 1416.1012 1431.0400 1450.5260 1458.9778 1462.2241 1463.2538 1466.1278 1470.1305 1477.6994 1519.5123 1616.8939 1626.6940 2872.2520 2890.5057 2936.5374 2958.6142 2968.2822 2969.5540 2970.6622 2978.9677 3016.9679 3031.4969 3033.7583 3038.6502 3047.7624 3060.5956 3098.7472 3158.3761 3179.2666 3242.6817 3416.7869 3528.8870 3622.3353
redmass: 4.5282 3.7561 3.7474 5.0866 4.0370 3.3252 3.6431 4.2004 4.3704 3.3252 2.0472 1.1512 3.4651 5.1377 4.9379 1.9725 4.0190 3.5498 3.2387 3.7667 2.9788 2.5620 2.4322 1.1706 2.0046 4.1462 3.2477 4.4105 3.8645 1.4203 3.4628 4.6271 3.3905 1.2766 1.8773 1.6509 1.4275 1.5762 2.0778 3.0035 1.7189 1.5384 1.9516 2.8495 2.4458 1.3364 2.9680 2.9230 2.4444 1.7859 1.1410 2.4226 1.5086 2.3931 1.5244 2.4373 2.3730 1.4767 1.2355 1.3778 1.7294 1.9504 1.3103 1.2882 1.2737 1.2747 1.5498 1.2851 1.2691 1.3320 1.3216 1.4952 1.3747 1.4715 1.4906 1.4119 1.4999 1.7414 3.7281 3.8650 1.2128 1.0871 1.0898 1.0911 1.1348 1.0824 1.0958 3.3119 6.6158 7.2171 1.0818 1.0827 1.0684 1.0590 1.0640 1.0641 1.0625 1.0614 1.0997 1.0972 1.0972 1.1022 1.1035 1.0932 1.0909 1.0884 1.0963 1.0632 1.0739 1.0649 1.0666
irintensity: 1.1058 0.1556 0.2500 2.0294 0.8695 2.2312 0.1724 0.7929 3.8966 3.6534 4.0280 166.4980 0.5173 7.6006 10.0170 1.6369 3.4181 4.9503 4.6805 11.3515 14.1582 1.6671 15.6907 110.0445 0.1821 11.8430 13.1870 5.5525 11.6193 30.6410 2.0564 48.1674 34.0110 76.8445 22.5198 5.2174 0.3679 64.8768 21.6554 37.9266 7.2645 9.6597 0.3069 21.4112 4.0916 1.5004 3.8472 11.7582 86.6205 2.6440 11.2150 64.3120 0.9898 6.1930 73.5617 51.2724 2.9739 29.0123 12.6705 221.2320 57.0118 49.5973 2.0135 30.5138 26.8509 14.2569 49.8061 25.5216 0.8207 1.3235 4.9520 69.1658 1.1708 0.8333 9.1094 0.6076 22.7863 51.5926 29.0640 49.4078 12.7378 5.2238 12.9616 5.1179 19.9832 18.1439 3.4700 99.0258 15.3334 11.1843 57.2990 63.8238 61.6543 44.2409 31.1703 40.0905 35.2091 25.4376 53.6049 74.4284 37.6426 3.6148 123.0866 18.3727 16.1900 4.0809 3.9017 218.9701 0.9501 82.5983 43.8531
temp: 298.150 k
press: 1.00000 atm
elementType: 8 8 8 7 6 6 6 6 6 6 6 6 6 6 6 6 6 6 1 1 1 1 1 1 1 1 1 1 1 1 1 1 1 1 1 1 1 1 1
symmnumber: 1
zpe: 866319.7 jmol-1
zpe.correction: 0.329964 hartree
zpe.thermalcorrener: 0.347866 hartree
zpe.thermalcorrenthalpy: 0.348810 hartree
zpe.thermalcorrgfe: 0.281912 hartree
zpe.sumelectzpe: -825.105967 hartree
zpe.sumelectthermal: -825.088065 hartree
zpe.sumelectthermalent: -825.087120 hartree
zpe.sumelectthermalfe: -825.154018 hartree
dipole: 3.5412 -4.1250 -2.9120
dipole: 6.1674
quadrupole: -107.3956 -98.4651 -116.3657
quadrupole: 12.6823 4.5829 3.4833
quadrupole: 0.0132 8.9437 -8.9570 12.6823 4.5829 3.4833
hfenergy: -825.4359304 hartree
pointgroup: C01 [X(C14H21N1O3)]
dipole: 1.3968044 -1.122609 -1.6359151 debye
polarizability: 225.8117393|-11.7826235|149.782994|15.8720137|19.7488109|132.8570752 unknown
InChI: InChI=1S/C14H21NO3/c16-12-7-6-10(8-13(12)17)14(18)9-15-11-4-2-1-3-5-11/h6-8,11,14-18H,1-5,9H2
charge 0 multiplicity 1
39 atoms
O  0.094781 -0.743837 1.973116
O  -4.956925 -0.794608 -1.600422
O  -5.53095 1.473956 -0.249523
N  1.925835 -1.078314 0.029403
C  3.092702 -0.290744 -0.464453
C  3.241074 1.042013 0.310197
C  4.377284 -1.138591 -0.315241
C  4.480396 1.833432 -0.172438
C  5.628396 -0.362415 -0.789725
C  5.769981 0.987306 -0.046003
C  0.577112 -0.642128 -0.410228
C  -0.458167 -1.095233 0.669583
C  -1.812664 -0.436615 0.466382
C  -2.730026 -0.987587 -0.465715
C  -2.158052 0.74821 1.158064
C  -3.958194 -0.344764 -0.699233
C  -3.395719 1.388426 0.922438
C  -4.300217 0.849032 -0.011348
H  2.971903 -0.04572 -1.549196
H  3.340174 0.803389 1.388337
H  2.328039 1.657786 0.199424
H  4.275416 -2.081557 -0.891979
H  4.490992 -1.418386 0.752277
H  4.576465 2.769503 0.410023
H  4.339415 2.130926 -1.232512
H  5.549755 -0.171878 -1.880019
H  6.533596 -0.98103 -0.637976
H  6.638008 1.549785 -0.440695
H  5.972716 0.792633 1.027289
H  2.066796 -2.0858 -0.137746
H  0.566636 0.461003 -0.454724
H  0.284406 -1.02458 -1.412838
H  -0.575338 -2.202684 0.593846
H  -2.487325 -1.920626 -0.993889
H  1.089996 -0.825288 1.821454
H  -1.457023 1.139204 1.900331
H  -3.678977 2.299001 1.458832
H  -4.707345 -1.647599 -2.028614
H  -6.030652 0.941482 -0.92308
