program: Orca
programVersion: 5.0.2
elementType: Cl F F F O O O N C C C C C C C C C C C C C C C C C C C C C C C H H H H H H H H H H H H H H H H H H H
charge: 0
multiplicity: 1
keywords: wb97x-d3
keywords: def2-TZVPP
keywords: def2/J RIJCOSX
keywords: DEFGRID2
keywords: scfconv7
keywords: smallprint printgap noloewdin
keywords: NOSOSCF
formula: C23H19ClF3NO3
InChI: InChI=1/C23H19ClF3NO3/c1-22(2)17(12-19(24)23(25,26)27)20(22)21(29)31-18(13-28)14-7-6-10-16(11-14)30-15-8-4-3-5-9-15/h3-12,17-18,20H,1-2H3
50 atoms
Cl 3.505789 -1.876018 1.736499
F  4.514327 -4.532952 0.843045
F  5.75089 -2.98191 0.024322
F  4.471518 -4.127995 -1.271586
O  -1.225796 -0.841724 0.435018
O  -2.172114 -1.849355 -1.314144
O  -3.194056 4.137546 -0.009685
N  -3.857616 -2.793441 1.423711
C  1.044933 -0.324315 -1.64611
C  1.440851 -1.293246 -0.56322
C  0.165545 -1.51982 -1.352862
C  0.629832 1.061085 -1.216858
C  1.758004 -0.33618 -2.976096
C  2.531664 -2.249924 -0.752975
C  -1.183644 -1.424914 -0.767958
C  3.448221 -2.567721 0.153881
C  -2.49911 -0.595934 1.024026
C  4.546025 -3.556577 -0.070692
C  -3.288164 0.479012 0.31087
C  -3.25345 -1.840069 1.202966
C  -2.846569 1.790017 0.471418
C  -4.406406 0.203205 -0.462305
C  -3.529174 2.822414 -0.155582
C  -5.084066 1.248794 -1.074958
C  -4.650406 2.554507 -0.933696
C  -1.91821 4.478192 0.382327
C  -1.762948 5.191943 1.559375
C  -0.827173 4.165083 -0.416163
C  -0.491963 5.60306 1.939547
C  0.438417 4.569912 -0.018652
C  0.61072 5.289451 1.157271
H  1.31576 -0.917053 0.444734
H  0.20973 -2.298302 -2.106421
H  1.490513 1.729622 -1.271078
H  -0.136723 1.455608 -1.885348
H  0.251131 1.104526 -0.198619
H  1.143712 0.158709 -3.729661
H  2.70105 0.208277 -2.906773
H  1.973647 -1.339734 -3.339429
H  2.590395 -2.747362 -1.71377
H  -2.256459 -0.245936 2.029747
H  -1.9879 1.993163 1.100173
H  -4.764344 -0.80954 -0.589031
H  -5.957739 1.041064 -1.677826
H  -5.180847 3.367124 -1.413276
H  -2.626146 5.428904 2.168086
H  -0.963676 3.615491 -1.33905
H  -0.36689 6.166299 2.854829
H  1.292219 4.326678 -0.637399
H  1.599589 5.607733 1.459138
elementType: Cl F O N C H
totalener: -1928.17297621 hartree
nucrepener: 3174.37346695 hartree
electener: -5102.54644316 hartree
oneelecener: -8954.80104265 hartree
twoeener: 3852.25459949 hartree
cpcmener: -0.04388972 hartree
kineticenergy: 1921.61035443 hartree
xcener: -157.116637291359 hartree
chargesum: -0.0000000
charge: -0.074415 -0.175023 -0.175119 -0.170862 -0.272598 -0.457405 -0.339155 -0.093340 0.098758 0.058684 -0.105530 -0.301432 -0.266011 -0.160376 0.442520 -0.073167 0.436327 0.509547 -0.005837 -0.238618 -0.271297 -0.188636 0.304158 -0.135379 -0.230140 0.268105 -0.214876 -0.209521 -0.142651 -0.149472 -0.169033 0.088212 0.103319 0.107042 0.109749 0.095327 0.100992 0.101974 0.094828 0.146824 0.140597 0.149948 0.139155 0.161331 0.149302 0.150163 0.174529 0.161606 0.165614 0.161285
qa: -0.0744 -0.1750 -0.1751 -0.1709 -0.2726 -0.4574 -0.3392 -0.0933 0.0988 0.0587 -0.1055 -0.3014 -0.2660 -0.1604 0.4425 -0.0732 0.4363 0.5095 -0.0058 -0.2386 -0.2713 -0.1886 0.3042 -0.1354 -0.2301 0.2681 -0.2149 -0.2095 -0.1427 -0.1495 -0.1690 0.0882 0.1033 0.1070 0.1097 0.0953 0.1010 0.1020 0.0948 0.1468 0.1406 0.1499 0.1392 0.1613 0.1493 0.1502 0.1745 0.1616 0.1656 0.1613
va: 1.2590 1.1240 1.1222 1.1332 2.1454 2.0457 2.0752 3.1067 3.8080 3.8145 3.9235 3.9159 3.9069 3.8736 4.1375 3.9812 3.8654 4.4872 3.6693 4.0597 3.9353 3.9398 3.7097 3.9603 4.0079 3.6847 3.9974 3.9274 3.8832 3.8728 3.9004 1.0404 1.0297 0.9994 0.9965 1.0025 1.0004 1.0008 1.0062 1.0152 0.9984 1.0049 1.0197 0.9890 1.0055 1.0044 0.9861 0.9881 0.9885 0.9893
dispcorr: -0.027679912 hartree
energy: -1928.200656119224
dipole: -27.71455 28.79579 1.08124 39.14125 -36.22155 2.91970 -13.80893 13.08585 -0.72307
magnitude: 3.19634 au
magnitude: 8.12444 debye
