program: Orca
programVersion: 5.0.2
elementType: Cl F F F O O O N C C C C C C C C C C C C C C C C C C C C C C C H H H H H H H H H H H H H H H H H H H
charge: 0
multiplicity: 1
keywords: wb97x-d3
keywords: def2-TZVPP
keywords: def2/J RIJCOSX
keywords: DEFGRID2
keywords: scfconv7
keywords: smallprint printgap noloewdin
keywords: NOSOSCF
formula: C23H19ClF3NO3
InChI: InChI=1/C23H19ClF3NO3/c1-22(2)17(12-19(24)23(25,26)27)20(22)21(29)31-18(13-28)14-7-6-10-16(11-14)30-15-8-4-3-5-9-15/h3-12,17-18,20H,1-2H3
50 atoms
Cl 2.432119 0.743818 1.449223
F  5.219726 -0.307571 1.578278
F  4.700625 -2.363977 1.945169
F  4.157564 -0.840232 3.36568
O  -1.779005 -1.403765 0.318516
O  -2.19016 -3.59086 0.198442
O  -2.129875 3.506075 -0.871706
N  -4.40442 -1.767612 -1.807262
C  0.746491 -2.416811 -1.27698
C  1.028429 -1.6864 0.012512
C  0.052641 -2.845379 -0.0033
C  -0.007897 -1.65812 -2.34167
C  1.756261 -3.384575 -1.84364
C  2.295062 -1.856233 0.722366
C  -1.401958 -2.677627 0.182835
C  2.967257 -0.898335 1.349871
C  -3.168113 -1.115359 0.406465
C  4.264532 -1.110821 2.059478
C  -3.287009 0.36975 0.629914
C  -3.845321 -1.504147 -0.836993
C  -2.682214 1.23256 -0.276702
C  -3.949889 0.857886 1.744036
C  -2.709081 2.595982 -0.033397
C  -4.00133 2.230566 1.95254
C  -3.374388 3.101567 1.07845
C  -1.038023 3.149996 -1.630225
C  -1.019703 3.574386 -2.94971
C  0.034668 2.448296 -1.092463
C  0.086232 3.292605 -3.740454
C  1.123983 2.156344 -1.900149
C  1.156636 2.576762 -3.223605
H  0.589552 -0.697849 0.069809
H  0.407265 -3.784392 0.40742
H  -0.663796 -0.885467 -1.943532
H  0.700779 -1.167353 -3.010699
H  -0.611297 -2.340365 -2.942927
H  1.265445 -4.066059 -2.539853
H  2.53141 -2.849186 -2.39413
H  2.241649 -3.993329 -1.082164
H  2.723652 -2.851097 0.738458
H  -3.634111 -1.664392 1.22984
H  -2.186949 0.837752 -1.156119
H  -4.414785 0.177788 2.445746
H  -4.517462 2.624492 2.817461
H  -3.396638 4.169434 1.25418
H  -1.860349 4.1246 -3.35274
H  0.025339 2.129409 -0.057672
H  0.102437 3.629044 -4.768682
H  1.95904 1.60672 -1.485642
H  2.013013 2.351704 -3.844887
elementType: Cl F O N C H
totalener: -1928.17492359 hartree
nucrepener: 3286.15840184 hartree
electener: -5214.33332543 hartree
oneelecener: -9178.22230029 hartree
twoeener: 3963.88897486 hartree
cpcmener: -0.04233383 hartree
kineticenergy: 1921.60435398 hartree
xcener: -157.114007947881 hartree
chargesum: 0.0000000
charge: -0.084489 -0.175438 -0.170922 -0.175666 -0.259606 -0.455896 -0.335718 -0.094807 0.112171 0.073841 -0.105847 -0.266280 -0.271529 -0.149012 0.421060 -0.058212 0.386595 0.508716 0.009895 -0.221151 -0.239569 -0.205124 0.273311 -0.107201 -0.242168 0.296751 -0.260412 -0.187911 -0.114234 -0.123446 -0.199615 0.055816 0.107100 0.061183 0.103181 0.112849 0.101251 0.102125 0.094032 0.143259 0.135923 0.177044 0.151014 0.162487 0.149857 0.148377 0.151483 0.161396 0.142298 0.161239
qa: -0.0845 -0.1754 -0.1709 -0.1757 -0.2596 -0.4559 -0.3357 -0.0948 0.1122 0.0738 -0.1058 -0.2663 -0.2715 -0.1490 0.4211 -0.0582 0.3866 0.5087 0.0099 -0.2212 -0.2396 -0.2051 0.2733 -0.1072 -0.2422 0.2968 -0.2604 -0.1879 -0.1142 -0.1234 -0.1996 0.0558 0.1071 0.0612 0.1032 0.1128 0.1013 0.1021 0.0940 0.1433 0.1359 0.1770 0.1510 0.1625 0.1499 0.1484 0.1515 0.1614 0.1423 0.1612
va: 1.2556 1.1242 1.1333 1.1234 2.1724 2.0429 2.0831 3.1052 3.7229 3.8237 3.9070 3.9304 3.9102 3.8587 4.1691 3.9434 3.7868 4.4866 3.6966 4.0213 3.9360 3.9497 3.7778 3.8890 4.0124 3.7415 4.0179 3.8722 3.8723 3.8102 3.9539 1.0296 1.0269 1.0068 1.0011 1.0063 1.0003 1.0004 1.0059 1.0165 1.0164 0.9802 1.0005 0.9879 1.0052 1.0072 0.9980 0.9870 1.0078 0.9900
dispcorr: -0.029444414 hartree
energy: -1928.204368004004
dipole: -22.97068 23.82194 0.85126 0.17682 0.11191 0.28873 -26.72367 27.08230 0.35863
magnitude: 0.96779 au
magnitude: 2.45993 debye
