program: Orca
programVersion: 5.0.2
elementType: Cl F F F O O O N C C C C C C C C C C C C C C C C C C C C C C C H H H H H H H H H H H H H H H H H H H
charge: 0
multiplicity: 1
keywords: wb97x-d3
keywords: def2-TZVPP
keywords: def2/J RIJCOSX
keywords: DEFGRID2
keywords: scfconv7
keywords: smallprint printgap noloewdin
keywords: NOSOSCF
formula: C23H19ClF3NO3
InChI: InChI=1/C23H19ClF3NO3/c1-22(2)17(12-19(24)23(25,26)27)20(22)21(29)31-18(13-28)14-7-6-10-16(11-14)30-15-8-4-3-5-9-15/h3-12,17-18,20H,1-2H3
50 atoms
Cl 4.523065 -0.768049 0.384418
F  4.428861 -4.519591 -0.597513
F  5.373865 -3.562163 1.084679
F  5.976208 -3.057682 -0.912461
O  -1.913561 -1.523425 0.447337
O  -0.449407 0.133396 0.78756
O  -3.484209 3.979067 -0.088547
N  -4.809143 -2.445152 1.731142
C  0.695905 -1.248108 -1.843289
C  1.62659 -1.379697 -0.665324
C  0.174295 -1.773809 -0.523474
C  0.345802 0.145715 -2.302317
C  0.768183 -2.239563 -2.977866
C  2.644458 -2.429255 -0.61284
C  -0.713152 -0.93931 0.305673
C  3.893244 -2.271592 -0.189105
C  -2.928296 -0.750144 1.087332
C  4.914955 -3.360864 -0.15588
C  -3.444663 0.327697 0.166272
C  -3.976179 -1.709738 1.435545
C  -3.260866 1.656565 0.513465
C  -4.030511 -0.014344 -1.047817
C  -3.641328 2.650794 -0.378542
C  -4.432423 0.990076 -1.912956
C  -4.229072 2.324855 -1.590839
C  -2.347677 4.399561 0.561228
C  -2.496504 5.418268 1.490547
C  -1.092733 3.875498 0.273663
C  -1.376357 5.917074 2.140373
C  0.015807 4.375736 0.941407
C  -0.118182 5.39411 1.87605
H  1.894175 -0.439124 -0.198372
H  -0.052328 -2.834123 -0.509353
H  0.396954 0.89093 -1.510704
H  1.040365 0.455719 -3.084487
H  -0.660243 0.167933 -2.725162
H  -0.157476 -2.212605 -3.55448
H  1.5865 -1.984196 -3.652986
H  0.914212 -3.265636 -2.643608
H  2.354426 -3.418282 -0.947058
H  -2.56407 -0.316518 2.023634
H  -2.811823 1.907667 1.466496
H  -4.173983 -1.052712 -1.320314
H  -4.893816 0.735128 -2.857304
H  -4.52494 3.108075 -2.276723
H  -3.480294 5.818227 1.700554
H  -0.970052 3.088752 -0.46037
H  -1.493383 6.712504 2.864423
H  0.992596 3.96494 0.722284
H  0.751602 5.778225 2.391642
elementType: Cl F O N C H
totalener: -1928.17553156 hartree
nucrepener: 3138.09584499 hartree
electener: -5066.27137655 hartree
oneelecener: -8882.75389553 hartree
twoeener: 3816.48251899 hartree
cpcmener: -0.03896894 hartree
kineticenergy: 1921.60793439 hartree
xcener: -157.112625916720 hartree
chargesum: -0.0000000
charge: -0.074694 -0.170790 -0.175211 -0.175197 -0.271086 -0.459966 -0.340556 -0.099957 0.090428 0.022709 -0.072084 -0.258200 -0.264305 -0.145602 0.390361 -0.072786 0.412950 0.511475 0.023243 -0.222061 -0.198023 -0.231542 0.278959 -0.126241 -0.222819 0.286453 -0.243491 -0.191572 -0.128908 -0.163542 -0.179669 0.081675 0.107391 0.083966 0.104132 0.100279 0.099741 0.103238 0.093825 0.145557 0.141271 0.150591 0.147558 0.163420 0.151339 0.148799 0.164867 0.161338 0.161554 0.161184
qa: -0.0747 -0.1708 -0.1752 -0.1752 -0.2711 -0.4600 -0.3406 -0.1000 0.0904 0.0227 -0.0721 -0.2582 -0.2643 -0.1456 0.3904 -0.0728 0.4130 0.5115 0.0232 -0.2221 -0.1980 -0.2315 0.2790 -0.1262 -0.2228 0.2865 -0.2435 -0.1916 -0.1289 -0.1635 -0.1797 0.0817 0.1074 0.0840 0.1041 0.1003 0.0997 0.1032 0.0938 0.1456 0.1413 0.1506 0.1476 0.1634 0.1513 0.1488 0.1649 0.1613 0.1616 0.1612
va: 1.2585 1.1334 1.1237 1.1225 2.1405 2.0443 2.0713 3.1103 3.7592 3.8590 3.8438 3.9095 3.9055 3.8888 4.2018 3.9794 3.7296 4.4851 3.5619 4.0762 3.9310 3.9732 3.7188 3.8991 4.0177 3.6881 3.9979 3.8843 3.8820 3.9040 3.8969 1.0474 1.0301 1.0143 1.0022 0.9999 1.0010 1.0003 1.0058 1.0155 1.0153 1.0077 1.0096 0.9880 1.0036 1.0071 0.9868 0.9879 0.9903 0.9891
dispcorr: -0.026382493 hartree
energy: -1928.201914050161
dipole: -35.88542 35.80118 -0.08424 26.87127 -26.33174 0.53953 -13.53736 11.85400 -1.68336
magnitude: 1.76972 au
magnitude: 4.49827 debye
