program: Orca
programVersion: 5.0.2
elementType: Cl F F F O O O N C C C C C C C C C C C C C C C C C C C C C C C H H H H H H H H H H H H H H H H H H H
charge: 0
multiplicity: 1
keywords: wb97x-d3
keywords: def2-TZVPP
keywords: def2/J RIJCOSX
keywords: DEFGRID2
keywords: scfconv7
keywords: smallprint printgap noloewdin
keywords: NOSOSCF
formula: C23H19ClF3NO3
InChI: InChI=1/C23H19ClF3NO3/c1-22(2)17(12-19(24)23(25,26)27)20(22)21(29)31-18(13-28)14-7-6-10-16(11-14)30-15-8-4-3-5-9-15/h3-12,17-18,20H,1-2H3
50 atoms
Cl 4.510311 -0.886845 0.376964
F  5.979845 -3.190089 -0.85374
F  4.434355 -4.655045 -0.54145
F  5.35507 -3.674961 1.141331
O  -1.858965 -1.527178 0.633028
O  -0.360731 0.127895 0.754736
O  -3.523084 3.976013 -0.186987
N  -4.749338 -2.255218 2.041584
C  0.622004 -1.491112 -1.802938
C  1.618536 -1.528738 -0.673737
C  0.174228 -1.894946 -0.413763
C  0.255619 -0.138202 -2.362607
C  0.61315 -2.58058 -2.846336
C  2.63709 -2.575342 -0.58782
C  -0.659346 -0.978431 0.382784
C  3.884921 -2.404609 -0.166189
C  -2.831729 -0.675852 1.234569
C  4.910423 -3.489426 -0.107175
C  -3.348164 0.344657 0.248082
C  -3.89955 -1.57215 1.676472
C  -3.202321 1.694431 0.527905
C  -3.914484 -0.076288 -0.950667
C  -3.612286 2.629764 -0.413669
C  -4.334061 0.87011 -1.87108
C  -4.175612 2.22434 -1.61391
C  -2.412607 4.504323 0.424779
C  -2.62114 5.594001 1.258512
C  -1.129415 4.027105 0.185072
C  -1.533668 6.215162 1.855085
C  -0.05272 4.653816 0.796862
C  -0.246043 5.747051 1.630868
H  1.913541 -0.554266 -0.302716
H  -0.059814 -2.946949 -0.295408
H  0.906965 0.094055 -3.206205
H  -0.772469 -0.140163 -2.729348
H  0.357028 0.671622 -1.643338
H  0.757737 -3.576202 -2.429342
H  -0.344206 -2.583425 -3.369061
H  1.394835 -2.406511 -3.587456
H  2.350525 -3.573447 -0.896793
H  -2.431182 -0.184319 2.126772
H  -2.766131 2.007105 1.468795
H  -4.031461 -1.130873 -1.167749
H  -4.778727 0.55413 -2.804962
H  -4.491228 2.963346 -2.338897
H  -3.626961 5.954222 1.434351
H  -0.959598 3.181303 -0.469798
H  -1.698957 7.065227 2.503931
H  0.946884 4.28361 0.610772
H  0.599999 6.23024 2.100749
elementType: Cl F O N C H
totalener: -1928.17556711 hartree
nucrepener: 3124.77877766 hartree
electener: -5052.95434477 hartree
oneelecener: -8856.12777070 hartree
twoeener: 3803.17342593 hartree
cpcmener: -0.03903102 hartree
kineticenergy: 1921.60068600 hartree
xcener: -157.111399702852 hartree
chargesum: 0.0000000
charge: -0.074932 -0.175202 -0.170701 -0.175295 -0.273270 -0.456912 -0.339292 -0.100237 0.093817 0.014615 -0.061106 -0.262166 -0.268715 -0.139407 0.381423 -0.072065 0.421760 0.511309 0.024977 -0.222754 -0.199861 -0.238939 0.281059 -0.125639 -0.221562 0.292074 -0.251337 -0.190969 -0.125794 -0.161114 -0.183704 0.079851 0.107166 0.105173 0.098594 0.088300 0.094409 0.099699 0.103899 0.143166 0.141344 0.150520 0.148443 0.162870 0.151205 0.148405 0.163623 0.161216 0.161639 0.160417
qa: -0.0749 -0.1752 -0.1707 -0.1753 -0.2733 -0.4569 -0.3393 -0.1002 0.0938 0.0146 -0.0611 -0.2622 -0.2687 -0.1394 0.3814 -0.0721 0.4218 0.5113 0.0250 -0.2228 -0.1999 -0.2389 0.2811 -0.1256 -0.2216 0.2921 -0.2513 -0.1910 -0.1258 -0.1611 -0.1837 0.0799 0.1072 0.1052 0.0986 0.0883 0.0944 0.0997 0.1039 0.1432 0.1413 0.1505 0.1484 0.1629 0.1512 0.1484 0.1636 0.1612 0.1616 0.1604
va: 1.2582 1.1228 1.1334 1.1231 2.1382 2.0484 2.0707 3.1103 3.7548 3.8698 3.8296 3.9079 3.9068 3.8917 4.2171 3.9802 3.7161 4.4849 3.5603 4.0795 3.9421 3.9641 3.7177 3.8963 4.0137 3.6790 3.9990 3.8912 3.8815 3.9032 3.8989 1.0491 1.0296 1.0019 1.0005 1.0139 1.0062 1.0010 0.9999 1.0172 1.0163 1.0066 1.0104 0.9881 1.0036 1.0076 0.9891 0.9879 0.9901 0.9893
dispcorr: -0.026054593 hartree
energy: -1928.201621700770
dipole: -36.62343 36.50052 -0.12291 26.66908 -26.26320 0.40588 -14.25312 12.51331 -1.73981
magnitude: 1.79075 au
magnitude: 4.55173 debye
