program: Orca
programVersion: 5.0.2
elementType: Cl F F F O O O N C C C C C C C C C C C C C C C C C C C C C C C H H H H H H H H H H H H H H H H H H H
charge: 0
multiplicity: 1
keywords: wb97x-d3
keywords: def2-TZVPP
keywords: def2/J RIJCOSX
keywords: DEFGRID2
keywords: scfconv7
keywords: smallprint printgap noloewdin
keywords: NOSOSCF
formula: C23H19ClF3NO3
InChI: InChI=1/C23H19ClF3NO3/c1-22(2)17(12-19(24)23(25,26)27)20(22)21(29)31-18(13-28)14-7-6-10-16(11-14)30-15-8-4-3-5-9-15/h3-12,17-18,20H,1-2H3
50 atoms
Cl 3.66122 -3.139404 1.709705
F  4.737551 -4.964996 -0.459953
F  5.991125 -3.248821 -0.164593
F  4.843337 -3.437743 -1.974924
O  -1.876487 -1.349758 -1.209569
O  -1.14981 -1.536588 0.897617
O  -2.42533 3.558859 -0.465324
N  -4.740277 -1.489154 -2.833254
C  1.293786 -0.096528 -0.568848
C  1.659056 -1.473763 -0.073002
C  0.413388 -1.281737 -0.905703
C  0.861383 0.92004 0.458623
C  2.04979 0.518916 -1.720887
C  2.776993 -2.20723 -0.665373
C  -0.91041 -1.418415 -0.276604
C  3.676277 -2.926975 -0.005183
C  -3.208069 -1.230389 -0.732113
C  4.812507 -3.644071 -0.658945
C  -3.462386 0.109553 -0.075728
C  -4.051262 -1.380472 -1.918646
C  -2.832661 1.248584 -0.561582
C  -4.315802 0.186329 1.014164
C  -3.055437 2.46449 0.064004
C  -4.547221 1.416584 1.613778
C  -3.920722 2.561143 1.147953
C  -1.899316 4.503989 0.384416
C  -1.162106 4.146901 1.507099
C  -2.085676 5.837029 0.050483
C  -0.617141 5.144649 2.302574
C  -1.527319 6.824084 0.851392
C  -0.797414 6.484188 1.982088
H  1.49015 -1.633103 0.985759
H  0.457233 -1.603554 -1.940198
H  1.7373 1.454747 0.829258
H  0.19351 1.657181 0.009029
H  0.35825 0.485139 1.319527
H  1.459908 1.324575 -2.160213
H  2.991313 0.947976 -1.374627
H  2.272877 -0.190385 -2.515938
H  2.88248 -2.154741 -1.742219
H  -3.46161 -2.042628 -0.042879
H  -2.161011 1.205307 -1.410404
H  -4.792969 -0.706579 1.397122
H  -5.217906 1.485039 2.459595
H  -4.106856 3.514389 1.626053
H  -1.006889 3.105326 1.760927
H  -2.660214 6.09967 -0.828754
H  -0.042745 4.868254 3.177164
H  -1.673381 7.86412 0.590535
H  -0.369681 7.256122 2.607628
elementType: Cl F O N C H
totalener: -1928.17541304 hartree
nucrepener: 3123.04755252 hartree
electener: -5051.22296557 hartree
oneelecener: -8852.46368691 hartree
twoeener: 3801.24072134 hartree
cpcmener: -0.04021305 hartree
kineticenergy: 1921.60030329 hartree
xcener: -157.112136644834 hartree
chargesum: -0.0000000
charge: -0.074285 -0.175163 -0.175241 -0.171323 -0.280277 -0.447033 -0.343569 -0.100496 0.103742 0.018555 -0.060925 -0.279659 -0.265514 -0.140863 0.365624 -0.076889 0.417034 0.512783 0.019251 -0.223190 -0.249472 -0.197153 0.237276 -0.133177 -0.162873 0.286511 -0.179205 -0.242038 -0.174360 -0.131286 -0.177378 0.080925 0.106022 0.111324 0.088923 0.101804 0.100858 0.103919 0.094549 0.145133 0.150427 0.144556 0.149169 0.164110 0.161239 0.164274 0.148343 0.161755 0.160935 0.162328
qa: -0.0743 -0.1752 -0.1752 -0.1713 -0.2803 -0.4470 -0.3436 -0.1005 0.1037 0.0186 -0.0609 -0.2797 -0.2655 -0.1409 0.3656 -0.0769 0.4170 0.5128 0.0193 -0.2232 -0.2495 -0.1972 0.2373 -0.1332 -0.1629 0.2865 -0.1792 -0.2420 -0.1744 -0.1313 -0.1774 0.0809 0.1060 0.1113 0.0889 0.1018 0.1009 0.1039 0.0945 0.1451 0.1504 0.1446 0.1492 0.1641 0.1612 0.1643 0.1483 0.1618 0.1609 0.1623
va: 1.2588 1.1228 1.1231 1.1322 2.1187 2.0570 2.0430 3.1097 3.7581 3.8868 3.8324 3.8998 3.9036 3.8832 4.2266 3.9823 3.6957 4.4827 3.6138 4.0826 3.9975 3.9863 3.7762 3.8951 3.9036 3.6498 3.8750 4.0115 3.9260 3.8854 3.8917 1.0486 1.0312 1.0017 1.0017 1.0138 1.0019 1.0005 1.0060 1.0160 1.0129 1.0222 1.0008 0.9888 0.9934 0.9904 1.0071 0.9905 0.9882 0.9885
dispcorr: -0.026892488 hartree
energy: -1928.202305533434
dipole: -30.67999 30.75103 0.07104 45.56858 -43.65737 1.91121 4.46416 -3.57823 0.88593
magnitude: 2.10776 au
magnitude: 5.35751 debye
