program: Orca
programVersion: 5.0.2
elementType: Cl F F F O O O N C C C C C C C C C C C C C C C C C C C C C C C H H H H H H H H H H H H H H H H H H H
charge: 0
multiplicity: 1
keywords: wb97x-d3
keywords: def2-TZVPP
keywords: def2/J RIJCOSX
keywords: DEFGRID2
keywords: scfconv7
keywords: smallprint printgap noloewdin
keywords: NOSOSCF
formula: C23H19ClF3NO3
InChI: InChI=1/C23H19ClF3NO3/c1-22(2)17(12-19(24)23(25,26)27)20(22)21(29)31-18(13-28)14-7-6-10-16(11-14)30-15-8-4-3-5-9-15/h3-12,17-18,20H,1-2H3
50 atoms
Cl 1.83782 -0.032296 -1.869376
F  4.738355 -0.612866 -0.311669
F  3.752235 0.102242 1.458397
F  3.790543 1.310129 -0.323183
O  -2.343874 -2.228549 -0.148599
O  -2.427929 -2.104539 2.077332
O  -0.927993 2.53428 -0.987671
N  -4.440044 -1.821511 -2.670561
C  0.328031 -3.689819 0.162813
C  0.545602 -2.214091 -0.027343
C  -0.380312 -2.719102 1.075613
C  -0.405484 -4.43996 -0.922145
C  1.402956 -4.524269 0.81845
C  1.774119 -1.527533 0.371506
C  -1.80412 -2.344409 1.073073
C  2.387164 -0.575709 -0.325443
C  -3.556318 -1.488435 -0.234487
C  3.666942 0.062901 0.126929
C  -3.30131 -0.02368 0.034058
C  -4.034114 -1.687613 -1.602874
C  -2.237185 0.603494 -0.607032
C  -4.076747 0.668473 0.949842
C  -1.960983 1.926167 -0.317969
C  -3.792128 2.001302 1.220432
C  -2.732721 2.636383 0.594169
C  0.159192 2.966419 -0.272773
C  0.930208 3.959358 -0.864318
C  0.511313 2.438703 0.963587
C  2.056023 4.431383 -0.207622
C  1.636878 2.930569 1.612163
C  2.410776 3.927864 1.037258
H  0.043278 -1.800135 -0.893122
H  0.02761 -2.674763 2.079086
H  -0.994826 -5.252284 -0.493979
H  -1.066553 -3.814609 -1.515954
H  0.320524 -4.885236 -1.603982
H  1.881667 -4.025428 1.659875
H  0.974347 -5.455517 1.191409
H  2.176552 -4.78171 0.093637
H  2.213387 -1.809032 1.321891
H  -4.321154 -1.880463 0.443026
H  -1.61794 0.073663 -1.321817
H  -4.894643 0.171674 1.455469
H  -4.39556 2.545996 1.933777
H  -2.507784 3.673131 0.811101
H  0.648046 4.357192 -1.830974
H  -0.07329 1.653815 1.42591
H  2.652971 5.205317 -0.672182
H  1.906274 2.523139 2.577736
H  3.286207 4.303963 1.549162
elementType: Cl F O N C H
totalener: -1928.17005574 hartree
nucrepener: 3394.22677289 hartree
electener: -5322.39682863 hartree
oneelecener: -9395.54821786 hartree
twoeener: 4073.15138923 hartree
cpcmener: -0.04131948 hartree
kineticenergy: 1921.60482949 hartree
xcener: -157.112608408636 hartree
chargesum: 0.0000000
charge: -0.079120 -0.176295 -0.179014 -0.168733 -0.281938 -0.453683 -0.335230 -0.097728 0.090221 0.024941 -0.045896 -0.262263 -0.267806 -0.157022 0.377695 -0.068262 0.405755 0.535428 -0.021003 -0.227588 -0.186602 -0.171654 0.192301 -0.131781 -0.144860 0.257858 -0.232449 -0.155635 -0.131129 -0.196601 -0.177855 0.093195 0.098944 0.103871 0.093256 0.096834 0.092738 0.101160 0.102619 0.142380 0.144739 0.142169 0.150991 0.164150 0.162093 0.146840 0.151791 0.160013 0.159056 0.159108
qa: -0.0791 -0.1763 -0.1790 -0.1687 -0.2819 -0.4537 -0.3352 -0.0977 0.0902 0.0249 -0.0459 -0.2623 -0.2678 -0.1570 0.3777 -0.0683 0.4058 0.5354 -0.0210 -0.2276 -0.1866 -0.1717 0.1923 -0.1318 -0.1449 0.2579 -0.2324 -0.1556 -0.1311 -0.1966 -0.1779 0.0932 0.0989 0.1039 0.0933 0.0968 0.0927 0.1012 0.1026 0.1424 0.1447 0.1422 0.1510 0.1641 0.1621 0.1468 0.1518 0.1600 0.1591 0.1591
va: 1.2472 1.1173 1.1196 1.1311 2.1214 2.0477 2.0416 3.1057 3.7845 3.8225 3.8453 3.9017 3.9194 3.8945 4.1835 3.9635 3.7527 4.4424 3.6445 4.0786 4.0154 3.9490 3.8156 3.8853 3.9429 3.6384 3.9834 3.7795 3.8962 3.8798 3.8655 1.0244 1.0291 1.0001 1.0117 1.0002 1.0056 1.0006 1.0003 1.0194 1.0131 1.0189 1.0005 0.9882 0.9931 1.0082 1.0029 0.9876 0.9929 0.9889
dispcorr: -0.031355451 hartree
energy: -1928.201411192078
dipole: -17.93902 18.25117 0.31215 -11.49360 10.62783 -0.86577 9.71552 -7.86191 1.85361
magnitude: 2.06950 au
magnitude: 5.26026 debye
