program: Orca
programVersion: 5.0.2
elementType: Cl F F F O O O N C C C C C C C C C C C C C C C C C C C C C C C H H H H H H H H H H H H H H H H H H H
charge: 0
multiplicity: 1
keywords: wb97x-d3
keywords: def2-TZVPP
keywords: def2/J RIJCOSX
keywords: DEFGRID2
keywords: scfconv7
keywords: smallprint printgap noloewdin
keywords: NOSOSCF
formula: C23H19ClF3NO3
InChI: InChI=1/C23H19ClF3NO3/c1-22(2)17(12-19(24)23(25,26)27)20(22)21(29)31-18(13-28)14-7-6-10-16(11-14)30-15-8-4-3-5-9-15/h3-12,17-18,20H,1-2H3
50 atoms
Cl 2.434486 -4.118142 -0.301569
F  4.411192 -3.761297 -2.583428
F  5.369017 -3.731653 -0.665109
F  5.248767 -1.926548 -1.831241
O  -1.368049 -0.84933 -0.287656
O  -1.153885 0.761268 -1.813039
O  -3.313455 3.11939 2.119405
N  -3.162975 -1.682459 -3.040508
C  1.366718 0.118427 0.776908
C  1.5144 -1.113398 -0.073292
C  0.776492 0.104126 -0.616419
C  0.506818 0.022733 2.013331
C  2.551614 1.035421 0.970472
C  2.791583 -1.471021 -0.692105
C  -0.654231 0.062503 -0.966503
C  3.270322 -2.701869 -0.833141
C  -2.753897 -0.947614 -0.561963
C  4.579461 -3.023544 -1.479997
C  -3.547513 0.28795 -0.180738
C  -2.969301 -1.330129 -1.963253
C  -3.064425 1.119185 0.81753
C  -4.770157 0.559903 -0.78223
C  -3.776461 2.259353 1.160291
C  -5.493107 1.677125 -0.391516
C  -4.996134 2.545485 0.567734
C  -1.97489 3.43257 2.145611
C  -1.238832 3.631867 0.98247
C  -1.391218 3.597516 3.392707
C  0.093496 4.00396 1.083281
C  -0.058951 3.97887 3.476678
C  0.689708 4.179587 2.32583
H  0.884657 -1.943781 0.22181
H  1.326613 0.701236 -1.334539
H  1.138016 -0.228333 2.867267
H  0.033749 0.983406 2.228189
H  -0.267952 -0.737184 1.949838
H  3.112036 1.216115 0.054604
H  2.213572 2.003879 1.340345
H  3.23581 0.618333 1.711111
H  3.398126 -0.659005 -1.074651
H  -3.090078 -1.793107 0.044685
H  -2.132686 0.90087 1.322907
H  -5.169048 -0.086633 -1.553266
H  -6.44542 1.887213 -0.859378
H  -5.545226 3.434474 0.84959
H  -1.690506 3.505063 0.006747
H  -1.976427 3.435504 4.289071
H  0.667214 4.159862 0.179063
H  0.394473 4.110714 4.450373
H  1.72867 4.472981 2.394416
elementType: Cl F O N C H
totalener: -1928.17247117 hartree
nucrepener: 3237.03103627 hartree
electener: -5165.20350744 hartree
oneelecener: -9080.24656383 hartree
twoeener: 3915.04305638 hartree
cpcmener: -0.04277380 hartree
kineticenergy: 1921.59318076 hartree
xcener: -157.117844905201 hartree
chargesum: 0.0000000
charge: -0.073793 -0.174713 -0.174810 -0.170679 -0.280473 -0.449431 -0.340191 -0.092719 0.088686 0.036108 -0.062424 -0.259991 -0.280652 -0.158378 0.405530 -0.073371 0.459689 0.509392 -0.032794 -0.237084 -0.226220 -0.206125 0.255856 -0.117726 -0.233320 0.272863 -0.172967 -0.222471 -0.173809 -0.126029 -0.185258 0.092663 0.102058 0.115559 0.057502 0.103215 0.097911 0.097208 0.106975 0.144539 0.148488 0.192469 0.137397 0.162548 0.149905 0.153828 0.146535 0.164687 0.160649 0.163167
qa: -0.0738 -0.1747 -0.1748 -0.1707 -0.2805 -0.4494 -0.3402 -0.0927 0.0887 0.0361 -0.0624 -0.2600 -0.2807 -0.1584 0.4055 -0.0734 0.4597 0.5094 -0.0328 -0.2371 -0.2262 -0.2061 0.2559 -0.1177 -0.2333 0.2729 -0.1730 -0.2225 -0.1738 -0.1260 -0.1853 0.0927 0.1021 0.1156 0.0575 0.1032 0.0979 0.0972 0.1070 0.1445 0.1485 0.1925 0.1374 0.1625 0.1499 0.1538 0.1465 0.1647 0.1606 0.1632
va: 1.2598 1.1229 1.1242 1.1332 2.1430 2.0390 2.0740 3.1023 3.7083 3.8676 3.8802 3.8893 3.9115 3.8886 4.1610 3.9851 3.8069 4.4860 3.7595 4.1025 3.9315 3.9574 3.7581 3.9053 4.0139 3.6772 3.8368 3.9730 3.8386 3.8735 3.8490 1.0420 1.0293 1.0027 1.0193 1.0130 1.0070 1.0096 1.0014 1.0174 0.9910 0.9648 1.0125 0.9882 1.0041 1.0026 1.0071 0.9891 0.9882 0.9884
dispcorr: -0.030164820 hartree
energy: -1928.202635992546
dipole: -25.07027 25.29547 0.22519 38.94828 -37.71584 1.23245 22.88258 -20.05728 2.82530
magnitude: 3.09062 au
magnitude: 7.85573 debye
