program: Orca
programVersion: 5.0.2
elementType: Cl F F F O O O N C C C C C C C C C C C C C C C C C C C C C C C H H H H H H H H H H H H H H H H H H H
charge: 0
multiplicity: 1
keywords: wb97x-d3
keywords: def2-TZVPP
keywords: def2/J RIJCOSX
keywords: DEFGRID2
keywords: scfconv7
keywords: smallprint printgap noloewdin
keywords: NOSOSCF
formula: C23H19ClF3NO3
InChI: InChI=1/C23H19ClF3NO3/c1-22(2)17(12-19(24)23(25,26)27)20(22)21(29)31-18(13-28)14-7-6-10-16(11-14)30-15-8-4-3-5-9-15/h3-12,17-18,20H,1-2H3
50 atoms
Cl -2.078354 2.002497 2.530672
F  -1.919297 -0.430341 -0.49093
F  -3.393267 -0.262901 1.068928
F  -1.372074 -0.798374 1.561134
O  1.479268 2.092829 -0.114146
O  2.729071 3.807448 0.599475
O  0.404212 -2.892078 -1.329956
N  3.658397 1.396009 -2.55598
C  -0.402251 4.429371 -0.996846
C  -0.986655 3.618787 0.117237
C  0.423452 4.17536 0.247189
C  -0.037295 3.784871 -2.311977
C  -0.917015 5.840916 -1.156666
C  -1.27417 2.183072 -0.024405
C  1.664412 3.369726 0.267286
C  -1.774422 1.421669 0.938365
C  2.621908 1.244218 -0.158984
C  -2.116352 -0.024713 0.76479
C  2.192701 -0.156292 0.188218
C  3.208681 1.329593 -1.501008
C  1.464678 -0.918022 -0.712032
C  2.512546 -0.666612 1.439155
C  1.069149 -2.205034 -0.370103
C  2.115405 -1.951186 1.770324
C  1.402668 -2.730331 0.873847
C  -0.266438 -4.049007 -1.037334
C  -1.299016 -4.075512 -0.109283
C  0.074708 -5.188172 -1.748968
C  -1.987857 -5.258792 0.10358
C  -0.630357 -6.363231 -1.534483
C  -1.659035 -6.405023 -0.606106
H  -1.692556 4.137783 0.758151
H  0.520388 5.028616 0.908114
H  0.72581 4.375359 -2.820238
H  0.350002 2.773019 -2.225355
H  -0.912555 3.749012 -2.962703
H  -1.188711 6.288367 -0.200044
H  -0.163485 6.479414 -1.619532
H  -1.804441 5.855407 -1.791444
H  -1.106028 1.717802 -0.985938
H  3.376333 1.588964 0.553333
H  1.216977 -0.537283 -1.695736
H  3.073094 -0.070067 2.147341
H  2.37156 -2.360583 2.7381
H  1.118178 -3.737707 1.145441
H  -1.565023 -3.183794 0.440686
H  0.879252 -5.146199 -2.471264
H  -2.794021 -5.279171 0.82483
H  -0.368472 -7.250565 -2.095195
H  -2.205753 -7.323198 -0.439938
totalener: -1928.15907806 hartree
nucrepener: 3352.96006495 hartree
electener: -5281.11914301 hartree
oneelecener: -9312.95421942 hartree
twoeener: 4031.83507641 hartree
kineticenergy: 1921.69168973 hartree
xcener: -157.122356456597 hartree
chargesum: -0.0000000
charge: -0.054933 -0.175247 -0.164086 -0.170527 -0.255423 -0.341169 -0.286880 0.005565 0.077120 -0.044878 -0.100673 -0.261301 -0.235848 -0.069987 0.355918 -0.089808 0.265913 0.523856 0.097798 -0.267218 -0.269898 -0.151930 0.254207 -0.110024 -0.167589 0.218179 -0.155971 -0.171461 -0.141912 -0.110681 -0.122645 0.095016 0.092053 0.106521 0.074449 0.102682 0.075691 0.099152 0.091426 0.129170 0.120774 0.114597 0.112540 0.128906 0.131681 0.136697 0.126690 0.128575 0.127428 0.127483
qa: -0.0549 -0.1752 -0.1641 -0.1705 -0.2554 -0.3412 -0.2869 0.0056 0.0771 -0.0449 -0.1007 -0.2613 -0.2358 -0.0700 0.3559 -0.0898 0.2659 0.5239 0.0978 -0.2672 -0.2699 -0.1519 0.2542 -0.1100 -0.1676 0.2182 -0.1560 -0.1715 -0.1419 -0.1107 -0.1226 0.0950 0.0921 0.1065 0.0744 0.1027 0.0757 0.0992 0.0914 0.1292 0.1208 0.1146 0.1125 0.1289 0.1317 0.1367 0.1267 0.1286 0.1274 0.1275
va: 1.2844 1.1283 1.1474 1.1321 2.1124 2.1646 2.1137 3.1092 3.8411 3.7893 3.8757 3.9147 3.9048 3.7816 4.2241 4.0699 3.8578 4.4026 3.6207 4.0082 4.0633 4.0035 3.8652 3.9919 3.9486 3.8017 3.9328 4.0316 3.9925 3.9419 3.9414 1.0241 1.0271 1.0039 1.0179 1.0001 1.0082 1.0038 1.0039 1.0176 1.0339 1.0317 1.0099 1.0012 1.0064 1.0129 1.0118 1.0009 0.9991 0.9997
dispcorr: -0.029577469 hartree
energy: -1928.188655527204
dipole: 9.24751 -10.34811 -1.10060 4.97595 -5.06445 -0.08850 -14.72626 15.35542 0.62915
magnitude: 1.27082 au
magnitude: 3.23017 debye
