program: Orca
programVersion: 5.0.2
elementType: Cl F F F O O O N C C C C C C C C C C C C C C C C C C C C C C C H H H H H H H H H H H H H H H H H H H
charge: 0
multiplicity: 1
keywords: wb97x-d3
keywords: def2-TZVPP
keywords: def2/J RIJCOSX
keywords: DEFGRID2
keywords: scfconv7
keywords: smallprint printgap noloewdin
keywords: NOSOSCF
formula: C23H19ClF3NO3
InChI: InChI=1/C23H19ClF3NO3/c1-22(2)17(12-19(24)23(25,26)27)20(22)21(29)31-18(13-28)14-7-6-10-16(11-14)30-15-8-4-3-5-9-15/h3-12,17-18,20H,1-2H3
50 atoms
Cl -1.546621 1.579396 2.377862
F  -2.203039 -0.885882 0.819312
F  -3.059441 0.115419 -0.883788
F  -3.983599 0.289133 1.053647
O  2.541579 2.299293 0.070549
O  0.94907 1.648978 -1.354782
O  1.539284 -3.448579 -0.708534
N  4.095683 0.903468 -2.625852
C  -0.279417 4.463325 -0.909448
C  -0.861832 3.56927 0.134151
C  0.653648 3.637329 -0.05111
C  -0.46244 4.17517 -2.379386
C  -0.274832 5.943147 -0.599693
C  -1.607013 2.339693 -0.190904
C  1.35038 2.435598 -0.546102
C  -1.978031 1.444767 0.715142
C  3.241016 1.086674 -0.162273
C  -2.809731 0.233125 0.420155
C  2.477132 -0.121237 0.337959
C  3.676596 0.981873 -1.559374
C  2.31372 -1.258759 -0.433249
C  1.937607 -0.061005 1.618282
C  1.619063 -2.345596 0.081546
C  1.231912 -1.143997 2.112293
C  1.070516 -2.293328 1.35594
C  0.412208 -4.222871 -0.675541
C  0.576198 -5.596706 -0.592941
C  -0.85588 -3.664119 -0.770979
C  -0.541299 -6.41835 -0.610319
C  -1.963926 -4.495951 -0.773318
C  -1.813602 -5.873409 -0.694691
H  -1.193096 4.050828 1.048837
H  1.190517 4.176657 0.720054
H  -1.412287 4.593103 -2.717188
H  0.329541 4.656254 -2.954565
H  -0.445251 3.119712 -2.633991
H  -1.211759 6.40243 -0.9179
H  -0.154747 6.141347 0.466055
H  0.538734 6.445524 -1.124721
H  -1.895594 2.164845 -1.218543
H  4.152846 1.19817 0.431393
H  2.70524 -1.316351 -1.440956
H  2.054102 0.825936 2.227264
H  0.802467 -1.096726 3.103687
H  0.522016 -3.135698 1.756028
H  1.572356 -6.013263 -0.523026
H  -0.977803 -2.591849 -0.844106
H  -0.413101 -7.491024 -0.550373
H  -2.951515 -4.060122 -0.846187
H  -2.682854 -6.516899 -0.700502
totalener: -1928.15915597 hartree
nucrepener: 3352.91532892 hartree
electener: -5281.07448489 hartree
oneelecener: -9313.45062829 hartree
twoeener: 4032.37614340 hartree
kineticenergy: 1921.68951796 hartree
xcener: -157.125015205947 hartree
chargesum: -0.0000000
charge: -0.065985 -0.162399 -0.173563 -0.161135 -0.283087 -0.362842 -0.297146 0.005662 0.091946 -0.099217 -0.042549 -0.271636 -0.230993 -0.059172 0.337615 -0.083058 0.442988 0.519075 -0.022381 -0.292398 -0.144988 -0.246782 0.204245 -0.106562 -0.148943 0.211142 -0.192336 -0.134860 -0.101906 -0.126897 -0.131670 0.100466 0.084338 0.097165 0.094310 0.104167 0.093287 0.074474 0.097103 0.130189 0.122719 0.118137 0.118700 0.126288 0.131641 0.125431 0.134408 0.124872 0.127081 0.125059
qa: -0.0660 -0.1624 -0.1736 -0.1611 -0.2831 -0.3628 -0.2971 0.0057 0.0919 -0.0992 -0.0425 -0.2716 -0.2310 -0.0592 0.3376 -0.0831 0.4430 0.5191 -0.0224 -0.2924 -0.1450 -0.2468 0.2042 -0.1066 -0.1489 0.2111 -0.1923 -0.1349 -0.1019 -0.1269 -0.1317 0.1005 0.0843 0.0972 0.0943 0.1042 0.0933 0.0745 0.0971 0.1302 0.1227 0.1181 0.1187 0.1263 0.1316 0.1254 0.1344 0.1249 0.1271 0.1251
va: 1.2694 1.1374 1.1309 1.1466 2.1158 2.1170 2.1108 3.1149 3.8210 3.8754 3.8632 3.9091 3.8952 3.8098 4.1229 4.0099 3.8857 4.4426 3.7407 4.0647 4.0191 3.9896 3.9367 3.9273 3.9260 3.8404 4.0286 3.9280 3.9388 3.9592 3.9494 1.0184 1.0317 0.9978 1.0039 1.0214 1.0047 1.0074 1.0044 1.0191 0.9867 1.0378 1.0219 1.0050 1.0048 1.0131 1.0170 0.9991 1.0026 1.0000
dispcorr: -0.029058659 hartree
energy: -1928.188214628211
dipole: 11.44126 -11.98188 -0.54062 9.39595 -8.12665 1.26930 -9.76832 11.08866 1.32034
magnitude: 1.90963 au
magnitude: 4.85389 debye
