program: Orca
programVersion: 5.0.2
elementType: Cl F F F O O O N C C C C C C C C C C C C C C C C C C C C C C C H H H H H H H H H H H H H H H H H H H
charge: 0
multiplicity: 1
keywords: wb97x-d3
keywords: def2-TZVPP
keywords: def2/J RIJCOSX
keywords: DEFGRID2
keywords: scfconv7
keywords: smallprint printgap noloewdin
keywords: NOSOSCF
formula: C23H19ClF3NO3
InChI: InChI=1/C23H19ClF3NO3/c1-22(2)17(12-19(24)23(25,26)27)20(22)21(29)31-18(13-28)14-7-6-10-16(11-14)30-15-8-4-3-5-9-15/h3-12,17-18,20H,1-2H3
50 atoms
Cl -2.475095 2.381998 2.360587
F  -1.965311 -0.32595 -0.374014
F  -3.705504 0.121887 0.812206
F  -1.89794 -0.534137 1.769063
O  1.574446 2.030802 -0.136677
O  2.905561 3.70164 0.529147
O  0.696223 -3.143758 -1.351856
N  3.771764 1.176832 -2.507019
C  -0.20027 4.402844 -1.102583
C  -0.818243 3.68587 0.060274
C  0.622808 4.171899 0.145817
C  0.114326 3.674796 -2.386964
C  -0.647695 5.827444 -1.332313
C  -1.198231 2.269195 -0.007105
C  1.822532 3.308186 0.201494
C  -1.931187 1.640761 0.902523
C  2.667209 1.116651 -0.137536
C  -2.374557 0.216489 0.776119
C  2.127552 -0.239756 0.232206
C  3.294681 1.146701 -1.462634
C  1.644769 -1.112406 -0.727993
C  2.067487 -0.576801 1.579674
C  1.110756 -2.338156 -0.344003
C  1.531447 -1.796376 1.950844
C  1.055505 -2.686519 0.999856
C  -0.051381 -4.258085 -1.073624
C  0.4993 -5.501605 -1.335973
C  -1.34582 -4.139176 -0.586549
C  -0.258595 -6.641817 -1.111333
C  -2.089521 -5.286122 -0.358319
C  -1.550105 -6.538699 -0.617739
H  -1.484937 4.282477 0.673614
H  0.767629 5.051542 0.761927
H  0.459151 2.652934 -2.25478
H  -0.772563 3.644482 -3.021783
H  0.89372 4.204761 -2.93571
H  -1.544495 5.850483 -1.953418
H  -0.880521 6.339091 -0.397916
H  0.127779 6.401341 -1.841208
H  -0.906028 1.698747 -0.87694
H  3.420364 1.429695 0.590916
H  1.691407 -0.869066 -1.782718
H  2.438727 0.107124 2.332232
H  1.487674 -2.068954 2.996531
H  0.65325 -3.64098 1.310657
H  1.50859 -5.570566 -1.720011
H  -1.765529 -3.159982 -0.39425
H  0.167133 -7.61427 -1.320132
H  -3.099655 -5.198186 0.018756
H  -2.13703 -7.429827 -0.441077
totalener: -1928.16048012 hartree
nucrepener: 3311.53302785 hartree
electener: -5239.69350797 hartree
oneelecener: -9230.02582205 hartree
twoeener: 3990.33231408 hartree
kineticenergy: 1921.69190668 hartree
xcener: -157.121898722256 hartree
chargesum: 0.0000000
charge: -0.056594 -0.181853 -0.164213 -0.166564 -0.254717 -0.340413 -0.287467 0.005557 0.067326 0.009661 -0.104140 -0.260497 -0.234108 -0.116633 0.357698 -0.079063 0.261412 0.523146 0.058078 -0.267041 -0.203383 -0.171690 0.234973 -0.120936 -0.152541 0.178252 -0.150907 -0.128521 -0.123239 -0.143926 -0.110538 0.085677 0.093233 0.080229 0.102372 0.105348 0.092149 0.075937 0.097599 0.124987 0.127864 0.117656 0.112311 0.127710 0.130560 0.127558 0.136362 0.128100 0.129151 0.128080
qa: -0.0566 -0.1819 -0.1642 -0.1666 -0.2547 -0.3404 -0.2875 0.0056 0.0673 0.0097 -0.1041 -0.2605 -0.2341 -0.1166 0.3577 -0.0791 0.2614 0.5231 0.0581 -0.2670 -0.2034 -0.1717 0.2350 -0.1209 -0.1525 0.1783 -0.1509 -0.1285 -0.1232 -0.1439 -0.1105 0.0857 0.0932 0.0802 0.1024 0.1053 0.0921 0.0759 0.0976 0.1250 0.1279 0.1177 0.1123 0.1277 0.1306 0.1276 0.1364 0.1281 0.1292 0.1281
va: 1.2816 1.1223 1.1446 1.1358 2.0970 2.1644 2.1177 3.1060 3.8367 3.7377 3.8727 3.9101 3.9056 3.8264 4.2227 4.0534 3.8480 4.4177 3.6861 4.0169 4.0444 3.9979 3.9031 3.9798 3.9395 3.8458 4.0141 3.9403 3.9455 3.9710 3.9282 1.0310 1.0267 1.0196 1.0002 1.0033 1.0036 1.0084 1.0041 1.0216 1.0250 1.0350 1.0105 1.0014 1.0081 1.0103 1.0104 0.9994 1.0006 0.9994
dispcorr: -0.028360966 hartree
energy: -1928.188841084029
dipole: 12.05632 -13.13526 -1.07894 2.69837 -2.80056 -0.10219 -14.73827 15.35617 0.61790
magnitude: 1.24754 au
magnitude: 3.17099 debye
