program: Orca
programVersion: 5.0.2
elementType: Cl F F F O O O N C C C C C C C C C C C C C C C C C C C C C C C H H H H H H H H H H H H H H H H H H H
charge: 0
multiplicity: 1
keywords: wb97x-d3
keywords: def2-TZVPP
keywords: def2/J RIJCOSX
keywords: DEFGRID2
keywords: scfconv7
keywords: smallprint printgap noloewdin
keywords: NOSOSCF
formula: C23H19ClF3NO3
InChI: InChI=1/C23H19ClF3NO3/c1-22(2)17(12-19(24)23(25,26)27)20(22)21(29)31-18(13-28)14-7-6-10-16(11-14)30-15-8-4-3-5-9-15/h3-12,17-18,20H,1-2H3
50 atoms
Cl -0.149705 1.542246 3.064544
F  -1.363304 -1.069813 2.162623
F  -3.13311 -0.201838 1.29488
F  -2.74311 0.009653 3.404474
O  2.199292 2.028334 -0.503252
O  0.204476 1.218555 -1.099669
O  0.493022 -3.462696 0.179261
N  2.6040 0.262079 -3.397039
C  -0.892847 4.059384 -0.576513
C  -0.934871 3.351024 0.732929
C  0.361994 3.375889 -0.073238
C  -1.655173 3.534783 -1.768964
C  -0.855119 5.569526 -0.520363
C  -1.667361 2.08639 0.933017
C  0.861006 2.100983 -0.62402
C  -1.417541 1.257499 1.93673
C  2.813057 0.79021 -0.845281
C  -2.170183 -0.010225 2.199646
C  2.401546 -0.338122 0.073839
C  2.649835 0.489929 -2.272187
C  1.622233 -1.397709 -0.369072
C  2.812044 -0.26936 1.397685
C  1.250952 -2.392375 0.525647
C  2.434313 -1.2693 2.280763
C  1.657506 -2.329621 1.85401
C  -0.065683 -3.50212 -1.073489
C  0.547293 -4.254332 -2.062072
C  -1.241094 -2.811544 -1.32656
C  -0.028728 -4.318564 -3.322414
C  -1.80638 -2.882215 -2.590328
C  -1.202299 -3.630505 -3.590626
H  -0.889534 3.972176 1.622795
H  1.136027 4.027672 0.313329
H  -2.678926 3.912571 -1.740479
H  -1.19976 3.894003 -2.692557
H  -1.692797 2.451459 -1.830557
H  -0.299273 5.935794 0.343678
H  -0.386527 5.980131 -1.415576
H  -1.866731 5.97366 -0.457003
H  -2.460273 1.829983 0.242987
H  3.877876 0.988564 -0.699212
H  1.296422 -1.43589 -1.399931
H  3.417908 0.558674 1.743584
H  2.747663 -1.221761 3.314939
H  1.356831 -3.110376 2.539933
H  1.465554 -4.783528 -1.843204
H  -1.702942 -2.225321 -0.54286
H  0.447789 -4.90316 -4.09805
H  -2.722577 -2.344486 -2.794497
H  -1.645256 -3.676709 -4.576244
totalener: -1928.15791971 hartree
nucrepener: 3436.86516848 hartree
electener: -5365.02308818 hartree
oneelecener: -9481.89098888 hartree
twoeener: 4116.86790069 hartree
kineticenergy: 1921.69942506 hartree
xcener: -157.126025341197 hartree
chargesum: 0.0000000
charge: -0.059055 -0.154815 -0.177530 -0.160138 -0.271364 -0.373764 -0.293044 0.006750 0.097477 -0.096929 -0.077889 -0.273197 -0.233979 -0.073926 0.369055 -0.069675 0.399704 0.521163 -0.047079 -0.291788 -0.092671 -0.265648 0.240754 -0.066533 -0.209172 0.166092 -0.134625 -0.103435 -0.130401 -0.142080 -0.098947 0.104950 0.083190 0.094540 0.094055 0.104030 0.074383 0.096325 0.092571 0.127398 0.125451 0.129181 0.108541 0.122299 0.122918 0.123202 0.121374 0.125422 0.122490 0.124370
qa: -0.0591 -0.1548 -0.1775 -0.1601 -0.2714 -0.3738 -0.2930 0.0068 0.0975 -0.0969 -0.0779 -0.2732 -0.2340 -0.0739 0.3691 -0.0697 0.3997 0.5212 -0.0471 -0.2918 -0.0927 -0.2656 0.2408 -0.0665 -0.2092 0.1661 -0.1346 -0.1034 -0.1304 -0.1421 -0.0989 0.1049 0.0832 0.0945 0.0941 0.1040 0.0744 0.0963 0.0926 0.1274 0.1255 0.1292 0.1085 0.1223 0.1229 0.1232 0.1214 0.1254 0.1225 0.1244
va: 1.2783 1.1385 1.1262 1.1489 2.1267 2.0994 2.1152 3.1205 3.7896 3.8897 3.8751 3.9069 3.8997 3.8136 4.1040 3.9901 3.9087 4.4400 3.7012 4.0542 3.8493 4.0198 3.8466 3.9075 4.0238 3.8855 3.9994 3.9552 3.9616 3.9826 3.9336 1.0148 1.0332 0.9972 1.0046 1.0203 1.0073 1.0047 1.0043 1.0168 0.9903 1.0263 1.0172 0.9992 1.0142 1.0095 1.0207 1.0004 1.0021 1.0001
dispcorr: -0.030652707 hartree
energy: -1928.188572413488
dipole: 5.15868 -5.14404 0.01464 13.53441 -11.99273 1.54168 -25.00728 25.58195 0.57467
magnitude: 1.64537 au
magnitude: 4.18219 debye
