program: Gaussian 09
title: 000060395
version: EM64L-G09RevD.01
frameworkgroup: C1[X(C19H17Br2N3O3)]
method: RPBEPBE
basis: SDD
operation: Freq
keyword: #p
keyword: freq=noraman
keyword: PBEPBE/SDD
title: #p freq=noraman PBEPBE/SDD
converged: YES YES NO NO
title: Mulliken charges:
elementType: Br Br O O O N N N C C C C C C C C C C C C C C C C C C C H H H H H H H H H H H H H H H H H
charge: 0.051079 0.043440 -0.242467 -0.265882 -0.246066 -0.198240 -0.022918 -0.435928 -0.417027 0.158873 0.167109 0.197885 0.222335 -0.305293 -0.271704 -0.775492 -0.381029 -0.250851 -0.141055 -0.463722 0.257998 0.468706 -0.358083 -0.423757 -0.225721 -0.194616 -0.274697 0.307569 0.240656 0.250407 0.236770 0.293432 0.233376 0.241832 0.288608 0.276985 0.244333 0.278583 0.325688 0.233016 0.217354 0.216983 0.218200 0.223329
chargesum: 0.00000
title: Mulliken charges with hydrogens summed into heavy atoms:
elementType: Br Br O O O N N N C C C C C C C C C C C C C C C C C C C
charge: 0.051079 0.043440 -0.242467 -0.265882 -0.246066 -0.198240 -0.022918 -0.110240 0.131197 0.158873 0.167109 0.197885 0.222335 0.181884 0.021728 -0.011675 -0.381029 -0.250851 0.135930 0.059194 0.257998 0.468706 -0.125068 -0.206403 -0.008737 0.023584 -0.051368
polarizability: 3.43488793e+02 2.92227323e+01 3.54026328e+02 -4.98841420e+01 1.39266734e+01 1.51202437e+02
1716.lowfreq: -0.0003 0.0004 0.0005 0.5767 2.7109 4.4291 10.6224 13.2421 25.1124
frequency: 10.4443 13.2251 25.0247 35.0456 42.3900 64.1029 74.4169 77.5681 91.7929 109.4261 115.6338 135.7325 144.4452 166.4088 169.6517 185.4539 201.5980 217.8786 226.9387 230.0843 263.0287 266.7244 285.1527 346.5613 351.5369 365.5847 371.0891 391.4645 409.7634 443.1374 461.5551 480.9636 500.4775 506.8384 508.0529 529.5399 557.1199 559.3046 567.2272 571.8681 614.4366 620.0292 632.9327 668.3032 690.8284 692.3121 709.2581 731.9872 755.1524 787.3807 799.9877 814.4982 842.4419 845.2722 869.9211 876.4520 889.4262 898.8275 927.0045 954.0746 973.1418 977.2633 980.1950 993.6237 1002.1424 1006.6920 1023.6663 1039.3964 1047.2280 1079.8847 1082.9339 1109.8378 1131.3791 1144.5655 1163.8940 1169.8787 1190.6223 1194.2647 1210.3155 1213.3615 1250.7874 1258.9978 1276.1987 1282.9587 1330.6312 1331.9754 1347.7371 1365.5704 1372.9595 1380.3599 1390.7241 1395.0743 1399.3577 1420.6194 1434.3939 1442.4874 1442.9475 1462.8434 1466.2814 1476.6332 1484.0482 1515.5599 1527.5294 1561.1077 1583.1107 1587.1877 1606.1728 1628.0590 1650.8559 2922.8205 2977.9735 2990.1847 3028.1436 3046.6850 3070.3874 3104.6687 3113.2837 3117.0516 3123.1368 3136.9336 3137.0345 3148.7191 3165.6996 3176.4479 3179.6384 3543.3432
redmass: 8.4877 12.1491 4.0537 6.8034 5.9090 6.5958 8.1598 6.7834 6.8419 8.6888 14.4549 5.5998 3.5300 2.5483 3.2261 5.0040 1.5217 5.3111 4.2352 13.6406 6.0642 5.8043 6.1487 3.9583 4.6884 5.8266 6.4178 2.9659 2.8946 2.7843 1.4187 3.5055 3.5868 2.7397 6.2039 3.4209 3.8719 4.4909 5.0769 4.8720 6.3591 4.4719 4.1894 5.3483 4.2062 2.1495 7.2484 7.6566 1.8033 4.8174 6.3748 1.2633 5.0562 3.7923 1.5369 4.7918 1.4367 3.3984 1.4272 1.3647 1.2967 5.8485 3.5603 2.9593 1.9463 2.0906 2.2019 2.4299 1.7765 1.8488 1.6579 2.8138 5.0946 4.8837 2.3232 1.1301 1.1628 3.1325 1.1731 1.9384 1.4285 2.0841 1.6655 1.6110 2.0777 1.4115 1.6896 1.6607 2.2153 2.8390 3.9881 1.5886 2.1515 3.1856 2.2003 1.1081 1.1069 1.1380 1.2264 1.0551 1.6200 2.8117 8.9367 6.5711 8.2034 5.4006 10.3889 6.3138 8.6692 1.0646 1.0925 1.0403 1.0599 1.0605 1.0962 1.1045 1.0863 1.1048 1.0859 1.0972 1.0929 1.0941 1.1010 1.0929 1.0934 1.0768
irintensity: 0.0345 0.0328 0.0362 0.6767 0.1482 1.3475 0.1886 0.1777 1.9314 0.5816 0.5587 4.5865 7.8638 3.5225 1.4378 2.9691 0.7727 2.1138 0.2418 3.0236 3.2967 3.7574 13.8010 7.0974 12.1928 10.2394 1.1812 12.1779 0.0349 15.3555 56.1256 23.3203 13.9474 8.6225 4.7508 0.6437 5.2196 14.3559 5.6889 13.4038 0.6855 10.6771 6.7715 9.7958 25.0844 43.2910 0.6894 77.7491 86.3917 2.7544 26.5170 0.4132 9.9535 8.1242 11.6070 20.7797 16.8550 5.3506 7.1081 0.0496 0.9014 7.2430 12.2249 32.7038 13.0500 22.8576 1.8932 11.3901 3.4422 8.0864 10.6807 69.0020 328.3234 46.2065 54.8443 6.9424 5.4856 24.1679 2.4311 24.4944 4.3713 3.4323 36.8565 6.7033 132.9864 2.5279 102.6468 96.9282 1.4996 26.1158 6.7213 9.9959 73.4731 79.8321 2.9732 65.0406 22.0317 16.1739 57.4289 28.1400 1.3271 247.8439 58.4975 218.7102 49.9056 30.7111 406.2067 213.0138 140.8943 81.0607 19.7329 16.7849 23.1490 24.4939 15.1128 5.8024 12.4249 7.6715 3.8110 3.9102 28.3814 51.0462 15.3055 4.2534 0.2281 83.5240
temp: 298.150 k
press: 1.00000 atm
elementType: 35 35 8 8 8 7 7 7 6 6 6 6 6 6 6 6 6 6 6 6 6 6 6 6 6 6 6 1 1 1 1 1 1 1 1 1 1 1 1 1 1 1 1 1
symmnumber: 1
zpe: 855834.7 jmol-1
zpe.correction: 0.325970 hartree
zpe.thermalcorrener: 0.351340 hartree
zpe.thermalcorrenthalpy: 0.352284 hartree
zpe.thermalcorrgfe: 0.265666 hartree
zpe.sumelectzpe: -1149.164886 hartree
zpe.sumelectthermal: -1149.139516 hartree
zpe.sumelectthermalent: -1149.138572 hartree
zpe.sumelectthermalfe: -1149.225191 hartree
dipole: -2.5131 -4.6127 0.2390
dipole: 5.2583
quadrupole: -197.3975 -150.5184 -178.8232
quadrupole: 2.4826 0.1337 3.7744
quadrupole: -21.8178 25.0613 -3.2435 2.4826 0.1337 3.7744
hfenergy: -1149.4908562 hartree
pointgroup: C01 [X(C19H17Br2N3O3)]
dipole: -1.2028929 -1.6514506 0.3250336 debye
polarizability: 346.0736408|24.3867138|348.3880561|-59.6798325|-1.6129563|154.2558615 unknown
InChI: InChI=1S/C19H17Br2N3O3/c1-12-23-18-15(9-13(20)10-16(18)21)19(26)24(12)7-8-27-17(25)11-22-14-5-3-2-4-6-14/h2-6,9-10,22H,7-8,11H2,1H3
charge 0 multiplicity 1
44 atoms
Br -6.267224 1.302082 1.04694
Br -2.197371 4.830874 -1.051421
O  0.617918 -2.206828 0.968847
O  -0.312711 -0.415965 -1.276613
O  2.136401 -2.95794 -0.637251
N  -2.018997 -1.792337 -0.423413
N  -4.116156 -0.889763 0.342484
N  3.823141 -0.832458 -0.108879
C  -1.130268 -2.96522 -0.634275
C  -3.316607 -1.922783 0.113565
C  -2.373589 0.629595 -0.538348
C  -1.476023 -0.514451 -0.784229
C  -3.667147 0.395899 0.032522
C  -0.288473 -3.323131 0.60443
C  -1.925325 1.933836 -0.865588
C  -3.843111 -3.304893 0.424133
C  -4.497461 1.535207 0.270284
C  -2.776832 3.015027 -0.615151
C  -4.064745 2.832296 -0.046217
C  2.519129 -0.817393 0.526089
C  1.779125 -2.09962 0.200431
C  4.739458 0.21524 -0.004532
C  4.474127 1.369937 0.79058
C  5.984102 0.13761 -0.700503
C  5.430799 2.403875 0.883128
C  6.925652 1.178517 -0.599146
C  6.661896 2.322749 0.194334
H  -0.456342 -2.71894 -1.470814
H  -1.738766 -3.838033 -0.920891
H  0.308208 -4.227538 0.387611
H  -0.902135 -3.473115 1.506107
H  -0.930826 2.055526 -1.302948
H  -3.182297 -3.870267 1.104705
H  -3.976504 -3.907198 -0.494365
H  -4.824685 -3.182909 0.902639
H  -4.713357 3.690969 0.143164
H  2.587104 -0.715891 1.62921
H  1.873526 0.016799 0.167832
H  4.000772 -1.60291 -0.756096
H  3.526461 1.465115 1.330927
H  6.202233 -0.743913 -1.31675
H  5.206811 3.282703 1.499445
H  7.873999 1.09683 -1.143272
H  7.398194 3.129408 0.270397
