program: Orca
programVersion: 5.0.2
elementType: Cl F F F O O O N C C C C C C C C C C C C C C C C C C C C C C C H H H H H H H H H H H H H H H H H H H
charge: 0
multiplicity: 1
keywords: wb97x-d3
keywords: def2-TZVPP
keywords: def2/J RIJCOSX
keywords: DEFGRID2
keywords: scfconv7
keywords: smallprint printgap noloewdin
keywords: NOSOSCF
formula: C23H19ClF3NO3
InChI: InChI=1/C23H19ClF3NO3/c1-22(2)17(12-19(24)23(25,26)27)20(22)21(29)31-18(13-28)14-7-6-10-16(11-14)30-15-8-4-3-5-9-15/h3-12,17-18,20H,1-2H3
50 atoms
Cl -3.489056 4.147743 -2.322269
F  -3.924114 5.001829 0.518066
F  -2.206234 5.997568 -0.303701
F  -1.95137 4.500655 1.223476
O  1.84041 0.406255 -1.866909
O  0.94287 1.700374 -0.283511
O  0.9721 -3.767807 0.686531
N  4.865889 -0.754547 -2.566563
C  -1.600716 0.166436 -1.459491
C  -1.701734 1.624105 -1.821824
C  -0.41345 0.869266 -2.086673
C  -1.568785 -0.273361 -0.015687
C  -2.333057 -0.805687 -2.35283
C  -1.812501 2.67396 -0.804003
C  0.818333 1.077738 -1.300633
C  -2.553232 3.769055 -0.923088
C  2.993384 0.253458 -1.050366
C  -2.657062 4.82238 0.138485
C  2.71072 -0.658304 0.12193
C  4.027889 -0.310651 -1.919088
C  2.026277 -1.843745 -0.097763
C  3.101103 -0.297951 1.401435
C  1.706098 -2.662144 0.975574
C  2.795138 -1.133736 2.463302
C  2.092431 -2.31111 2.264992
C  0.955476 -4.815704 1.568281
C  2.116307 -5.522193 1.850778
C  -0.254644 -5.181964 2.133519
C  2.056841 -6.603528 2.714765
C  -0.302946 -6.27224 2.990141
C  0.850073 -6.982081 3.286971
H  -2.260181 1.825886 -2.728195
H  -0.22809 0.620431 -3.125414
H  -1.11583 -1.262951 0.064652
H  -1.013321 0.388334 0.643488
H  -2.587997 -0.343227 0.367021
H  -3.366726 -0.922457 -2.023617
H  -2.351875 -0.475849 -3.391977
H  -1.859948 -1.788452 -2.323558
H  -1.258993 2.556595 0.115512
H  3.348436 1.223875 -0.687768
H  1.723012 -2.139789 -1.09465
H  3.619492 0.63607 1.573123
H  3.086714 -0.855762 3.46707
H  1.842223 -2.939236 3.109348
H  3.054469 -5.231034 1.395567
H  -1.148621 -4.619527 1.898221
H  2.959293 -7.157648 2.935439
H  -1.247712 -6.562833 3.429708
H  0.809428 -7.829657 3.957307
totalener: -1928.16230522 hartree
nucrepener: 3134.71959124 hartree
electener: -5062.88189646 hartree
oneelecener: -8876.22410169 hartree
twoeener: 3813.34220522 hartree
kineticenergy: 1921.69525025 hartree
xcener: -157.124532316944 hartree
chargesum: 0.0000000
charge: -0.059997 -0.162941 -0.161069 -0.166892 -0.264076 -0.363115 -0.300445 0.002262 0.057483 0.052092 -0.049940 -0.264471 -0.230640 -0.175087 0.298199 -0.084070 0.328598 0.505810 0.073443 -0.258730 -0.274462 -0.137933 0.231337 -0.111061 -0.154569 0.194939 -0.143858 -0.170524 -0.124497 -0.112790 -0.121506 0.081372 0.093373 0.089876 0.100727 0.106327 0.094627 0.077012 0.094508 0.138475 0.123027 0.124993 0.108002 0.129848 0.135514 0.137055 0.124830 0.130787 0.128706 0.129449
qa: -0.0600 -0.1629 -0.1611 -0.1669 -0.2641 -0.3631 -0.3004 0.0023 0.0575 0.0521 -0.0499 -0.2645 -0.2306 -0.1751 0.2982 -0.0841 0.3286 0.5058 0.0734 -0.2587 -0.2745 -0.1379 0.2313 -0.1111 -0.1546 0.1949 -0.1439 -0.1705 -0.1245 -0.1128 -0.1215 0.0814 0.0934 0.0899 0.1007 0.1063 0.0946 0.0770 0.0945 0.1385 0.1230 0.1250 0.1080 0.1298 0.1355 0.1371 0.1248 0.1308 0.1287 0.1294
va: 1.2775 1.1416 1.1442 1.1375 2.1246 2.1196 2.0766 3.1191 3.8109 3.7557 3.8495 3.9145 3.9058 3.8822 4.2342 4.0504 3.8245 4.4838 3.6179 4.0234 4.0402 4.0245 3.8075 3.9827 3.9439 3.8511 3.9712 4.0152 3.9493 3.9461 3.9426 1.0398 1.0284 1.0019 1.0155 1.0023 1.0036 1.0086 1.0047 1.0351 1.0166 1.0317 1.0137 1.0010 1.0061 1.0029 1.0095 0.9994 0.9995 0.9995
dispcorr: -0.026395511 hartree
energy: -1928.188700728986
dipole: 13.83389 -14.47451 -0.64062 -52.79640 51.14803 -1.64836 9.15843 -8.20781 0.95062
magnitude: 2.00778 au
magnitude: 5.10336 debye
