program: Orca
programVersion: 5.0.2
elementType: Cl F F F O O O N C C C C C C C C C C C C C C C C C C C C C C C H H H H H H H H H H H H H H H H H H H
charge: 0
multiplicity: 1
keywords: wb97x-d3
keywords: def2-TZVPP
keywords: def2/J RIJCOSX
keywords: DEFGRID2
keywords: scfconv7
keywords: smallprint printgap noloewdin
keywords: NOSOSCF
formula: C23H19ClF3NO3
InChI: InChI=1/C23H19ClF3NO3/c1-22(2)17(12-19(24)23(25,26)27)20(22)21(29)31-18(13-28)14-7-6-10-16(11-14)30-15-8-4-3-5-9-15/h3-12,17-18,20H,1-2H3
50 atoms
Cl -4.258031 2.564039 -2.202738
F  -3.768553 5.000342 -0.522467
F  -2.657561 5.107705 -2.356885
F  -1.621952 4.833756 -0.486987
O  1.338196 -0.69745 -1.634081
O  0.941258 1.305879 -0.718056
O  2.330278 -2.573969 2.944951
N  3.872981 -1.873135 -3.413662
C  -1.690779 -0.250371 0.121238
C  -2.068066 0.687417 -0.990804
C  -0.864133 -0.225733 -1.150003
C  -1.132354 0.277787 1.420024
C  -2.55866 -1.471475 0.305369
C  -1.95223 2.143083 -0.861146
C  0.52829 0.259702 -1.132844
C  -2.837588 3.013624 -1.332001
C  2.729267 -0.480051 -1.521687
C  -2.71582 4.49918 -1.171622
C  3.278991 -0.885565 -0.166162
C  3.350937 -1.273568 -2.584948
C  2.498347 -1.589112 0.739008
C  4.585906 -0.541989 0.145555
C  3.036161 -1.940406 1.972316
C  5.112215 -0.9083 1.373651
C  4.346269 -1.606567 2.28976
C  1.182902 -3.259159 2.663593
C  1.146721 -4.266105 1.707017
C  0.058288 -2.963303 3.41994
C  -0.030113 -4.970764 1.508096
C  -1.109522 -3.684595 3.219514
C  -1.161149 -4.684943 2.260425
H  -2.911742 0.362972 -1.588239
H  -1.017172 -1.068233 -1.814232
H  -1.952556 0.582361 2.071769
H  -0.57871 -0.509625 1.934095
H  -0.465062 1.127661 1.309515
H  -3.400572 -1.244645 0.961543
H  -2.964503 -1.832309 -0.64031
H  -1.990497 -2.28486 0.759486
H  -1.094171 2.54629 -0.343174
H  2.971326 0.573063 -1.703493
H  1.480862 -1.861727 0.494319
H  5.193877 0.005112 -0.564226
H  6.131458 -0.645143 1.621658
H  4.749735 -1.888088 3.253174
H  2.030483 -4.503964 1.128738
H  0.108554 -2.183116 4.168414
H  -0.057436 -5.756466 0.764936
H  -1.98365 -3.457637 3.815338
H  -2.073646 -5.244268 2.104986
totalener: -1928.16312173 hartree
nucrepener: 3211.82260022 hartree
electener: -5139.98572195 hartree
oneelecener: -9030.02768846 hartree
twoeener: 3890.04196651 hartree
kineticenergy: 1921.66983047 hartree
xcener: -157.124616206362 hartree
chargesum: -0.0000000
charge: -0.058627 -0.162360 -0.160643 -0.165929 -0.275430 -0.369049 -0.291866 0.004022 0.080046 0.047491 -0.083278 -0.251054 -0.218015 -0.189759 0.316690 -0.080294 0.309148 0.505641 0.069296 -0.258807 -0.221488 -0.219766 0.313291 -0.063929 -0.228040 0.284772 -0.193386 -0.254521 -0.085628 -0.096235 -0.152987 0.082535 0.094779 0.103288 0.074015 0.108159 0.094691 0.079521 0.073027 0.144342 0.134541 0.117424 0.115538 0.128869 0.128480 0.139485 0.136541 0.134119 0.129981 0.131359
qa: -0.0586 -0.1624 -0.1606 -0.1659 -0.2754 -0.3690 -0.2919 0.0040 0.0800 0.0475 -0.0833 -0.2511 -0.2180 -0.1898 0.3167 -0.0803 0.3091 0.5056 0.0693 -0.2588 -0.2215 -0.2198 0.3133 -0.0639 -0.2280 0.2848 -0.1934 -0.2545 -0.0856 -0.0962 -0.1530 0.0825 0.0948 0.1033 0.0740 0.1082 0.0947 0.0795 0.0730 0.1443 0.1345 0.1174 0.1155 0.1289 0.1285 0.1395 0.1365 0.1341 0.1300 0.1314
va: 1.2793 1.1419 1.1452 1.1391 2.1059 2.1108 2.1295 3.1231 3.7737 3.7653 3.8839 3.8928 3.9112 3.8836 4.1849 4.0512 3.8014 4.4853 3.7409 3.9961 3.9684 4.0731 3.7504 3.9390 4.0496 3.7344 3.9680 3.9800 3.8999 3.8524 3.9159 1.0401 1.0315 1.0029 1.0169 1.0207 1.0046 1.0129 1.0114 1.0340 1.0191 1.0176 1.0110 0.9988 1.0135 1.0025 1.0114 0.9975 0.9994 1.0002
dispcorr: -0.028502623 hartree
energy: -1928.191624353893
dipole: 15.56964 -16.02432 -0.45468 -42.91666 41.66893 -1.24773 23.17901 -21.73543 1.44359
magnitude: 1.96150 au
magnitude: 4.98575 debye
