program: Orca
programVersion: 5.0.2
elementType: Cl F F F O O O N C C C C C C C C C C C C C C C C C C C C C C C H H H H H H H H H H H H H H H H H H H
charge: 0
multiplicity: 1
keywords: wb97x-d3
keywords: def2-TZVPP
keywords: def2/J RIJCOSX
keywords: DEFGRID2
keywords: scfconv7
keywords: smallprint printgap noloewdin
keywords: NOSOSCF
formula: C23H19ClF3NO3
InChI: InChI=1/C23H19ClF3NO3/c1-22(2)17(12-19(24)23(25,26)27)20(22)21(29)31-18(13-28)14-7-6-10-16(11-14)30-15-8-4-3-5-9-15/h3-12,17-18,20H,1-2H3
50 atoms
Cl -3.992444 3.930894 -2.235114
F  -1.905282 5.847233 -3.262015
F  -2.21819 4.239637 -4.651742
F  -0.369988 4.367201 -3.557125
O  -0.306859 -1.105823 -0.568469
O  0.572942 0.832884 -1.240876
O  2.823812 -2.742579 3.359818
N  0.17738 -4.266444 -1.437965
C  -1.450534 2.012382 0.849504
C  -2.130805 2.117811 -0.486268
C  -1.514256 0.794919 -0.048522
C  -0.149933 2.73043 1.112997
C  -2.35278 1.967791 2.060317
C  -1.57606 2.919789 -1.58092
C  -0.309214 0.232359 -0.688842
C  -2.285521 3.720016 -2.368202
C  0.858077 -1.775489 -1.040737
C  -1.687679 4.546954 -3.467478
C  1.991287 -1.684916 -0.047935
C  0.456129 -3.166863 -1.259049
C  1.848748 -2.282886 1.198803
C  3.145348 -0.989774 -0.371642
C  2.887846 -2.206781 2.114604
C  4.171235 -0.906846 0.558841
C  4.052183 -1.515959 1.79437
C  2.073789 -3.858005 3.613069
C  2.056394 -4.952865 2.758121
C  1.366182 -3.882612 4.80559
C  1.307926 -6.068126 3.100728
C  0.634472 -5.011116 5.142449
C  0.595208 -6.104319 4.290376
H  -3.213628 2.104967 -0.44826
H  -2.233755 0.040886 0.247554
H  -0.358187 3.761091 1.403419
H  0.379005 2.254658 1.939979
H  0.527784 2.754968 0.265376
H  -2.589968 2.978243 2.396271
H  -3.294342 1.458278 1.853574
H  -1.86579 1.445924 2.885439
H  -0.512629 2.865951 -1.765046
H  1.174715 -1.363461 -2.003947
H  0.93785 -2.814904 1.446153
H  3.24054 -0.508853 -1.335632
H  5.076005 -0.366281 0.316142
H  4.853386 -1.462599 2.519593
H  2.616538 -4.941662 1.832093
H  1.398074 -3.023882 5.463237
H  1.288432 -6.916296 2.429642
H  0.086459 -5.02975 6.075137
H  0.016075 -6.979324 4.551806
totalener: -1928.16495295 hartree
nucrepener: 3099.55875712 hartree
electener: -5027.72371007 hartree
oneelecener: -8806.02232824 hartree
twoeener: 3778.29861817 hartree
kineticenergy: 1921.67930497 hartree
xcener: -157.122897783811 hartree
chargesum: 0.0000000
charge: -0.057874 -0.161972 -0.160937 -0.166388 -0.264999 -0.395006 -0.295436 -0.001412 0.053349 0.054375 -0.097689 -0.248865 -0.230606 -0.192375 0.373679 -0.080191 0.344656 0.504942 0.012874 -0.265727 -0.222767 -0.139232 0.250097 -0.084866 -0.212007 0.275964 -0.194283 -0.225862 -0.098037 -0.082679 -0.150445 0.082069 0.093884 0.097888 0.093629 0.100848 0.095300 0.076497 0.093064 0.150805 0.122104 0.133650 0.115175 0.129964 0.129426 0.136481 0.123906 0.131864 0.125855 0.127312
qa: -0.0579 -0.1620 -0.1609 -0.1664 -0.2650 -0.3950 -0.2954 -0.0014 0.0533 0.0544 -0.0977 -0.2489 -0.2306 -0.1924 0.3737 -0.0802 0.3447 0.5049 0.0129 -0.2657 -0.2228 -0.1392 0.2501 -0.0849 -0.2120 0.2760 -0.1943 -0.2259 -0.0980 -0.0827 -0.1504 0.0821 0.0939 0.0979 0.0936 0.1008 0.0953 0.0765 0.0931 0.1508 0.1221 0.1337 0.1152 0.1300 0.1294 0.1365 0.1239 0.1319 0.1259 0.1273
va: 1.2798 1.1420 1.1453 1.1379 2.1460 2.0930 2.1227 3.1164 3.8081 3.7396 3.9142 3.9118 3.9123 3.8754 4.1371 4.0520 3.8236 4.4852 3.6408 4.0187 3.9829 3.9977 3.8371 3.9495 4.0407 3.7664 3.9583 4.0509 3.9440 3.9255 3.9701 1.0380 1.0296 1.0011 1.0019 1.0181 1.0037 1.0087 1.0044 1.0319 1.0184 1.0159 1.0193 0.9991 1.0120 1.0029 1.0146 0.9991 0.9987 1.0003
dispcorr: -0.024752631 hartree
energy: -1928.189705583103
dipole: 16.61142 -16.32151 0.28991 -31.97970 32.07828 0.09858 41.77894 -40.09258 1.68636
magnitude: 1.71394 au
magnitude: 4.35649 debye
