program: Orca
programVersion: 5.0.2
elementType: Cl F F F O O O N C C C C C C C C C C C C C C C C C C C C C C C H H H H H H H H H H H H H H H H H H H
charge: 0
multiplicity: 1
keywords: wb97x-d3
keywords: def2-TZVPP
keywords: def2/J RIJCOSX
keywords: DEFGRID2
keywords: scfconv7
keywords: smallprint printgap noloewdin
keywords: NOSOSCF
formula: C23H19ClF3NO3
InChI: InChI=1/C23H19ClF3NO3/c1-22(2)17(12-19(24)23(25,26)27)20(22)21(29)31-18(13-28)14-7-6-10-16(11-14)30-15-8-4-3-5-9-15/h3-12,17-18,20H,1-2H3
50 atoms
Cl -0.328646 2.023016 3.458085
F  -1.173066 -0.869241 3.889566
F  0.840461 -0.726063 3.153449
F  -0.715061 -1.50719 1.885812
O  1.047576 1.553629 -0.396431
O  1.862705 3.6301 -0.48141
O  0.208761 -3.405949 -1.084989
N  2.93053 1.287842 -3.183637
C  -1.690583 2.830942 -0.774273
C  -1.48352 2.464317 0.658095
C  -0.450638 3.330128 -0.054589
C  -1.614466 1.794695 -1.869509
C  -2.723754 3.896968 -1.061238
C  -1.186044 1.088434 1.104215
C  0.93209 2.88997 -0.336827
C  -0.717837 0.799101 2.310379
C  2.327139 0.999258 -0.653393
C  -0.439436 -0.585703 2.810701
C  2.246113 -0.463179 -0.298567
C  2.667845 1.18079 -2.070666
C  1.267474 -1.244252 -0.904056
C  3.105057 -1.007142 0.637668
C  1.146037 -2.578558 -0.556119
C  2.984588 -2.352861 0.966362
C  2.012874 -3.138253 0.380327
C  -0.776292 -2.865138 -1.870955
C  -0.57635 -2.738327 -3.236739
C  -1.971289 -2.472589 -1.286688
C  -1.588845 -2.212046 -4.025382
C  -2.979187 -1.953651 -2.086321
C  -2.789756 -1.817082 -3.454042
H  -2.06475 3.028946 1.381734
H  -0.466386 4.380315 0.211163
H  -0.944112 0.96603 -1.663108
H  -2.60494 1.370652 -2.041794
H  -1.286893 2.253457 -2.803292
H  -2.781046 4.638822 -0.264058
H  -2.49102 4.423525 -1.987768
H  -3.713539 3.450604 -1.170018
H  -1.380028 0.268223 0.424258
H  3.094649 1.498336 -0.054355
H  0.610936 -0.80703 -1.645039
H  3.857639 -0.394078 1.116028
H  3.64925 -2.78822 1.699988
H  1.907963 -4.182032 0.644806
H  0.362686 -3.050273 -3.67522
H  -2.11295 -2.588652 -0.220391
H  -1.43594 -2.111051 -5.091456
H  -3.917962 -1.658332 -1.636318
H  -3.578422 -1.412878 -4.074177
totalener: -1928.15649729 hartree
nucrepener: 3476.95638222 hartree
electener: -5405.11287951 hartree
oneelecener: -9560.74390880 hartree
twoeener: 4155.63102929 hartree
kineticenergy: 1921.69792296 hartree
xcener: -157.124228290715 hartree
chargesum: 0.0000000
charge: -0.050131 -0.161313 -0.161636 -0.173640 -0.261631 -0.331326 -0.294853 0.003049 0.099563 -0.075594 -0.107486 -0.234552 -0.239909 -0.019311 0.348638 -0.117031 0.263603 0.521741 0.042873 -0.240991 -0.226393 -0.164838 0.250026 -0.073244 -0.191678 0.244388 -0.156714 -0.192884 -0.107073 -0.146396 -0.119868 0.105663 0.090321 0.033221 0.090292 0.111944 0.075890 0.100167 0.089661 0.107713 0.113888 0.128342 0.109875 0.125978 0.124842 0.131518 0.140395 0.132650 0.131335 0.130919
qa: -0.0501 -0.1613 -0.1616 -0.1736 -0.2616 -0.3313 -0.2949 0.0030 0.0996 -0.0756 -0.1075 -0.2346 -0.2399 -0.0193 0.3486 -0.1170 0.2636 0.5217 0.0429 -0.2410 -0.2264 -0.1648 0.2500 -0.0732 -0.1917 0.2444 -0.1567 -0.1929 -0.1071 -0.1464 -0.1199 0.1057 0.0903 0.0332 0.0903 0.1119 0.0759 0.1002 0.0897 0.1077 0.1139 0.1283 0.1099 0.1260 0.1248 0.1315 0.1404 0.1327 0.1313 0.1309
va: 1.2924 1.1487 1.1396 1.1226 2.1074 2.1786 2.1273 3.1143 3.8121 3.8341 3.8933 3.9081 3.9126 3.7456 4.2179 4.0468 3.9338 4.4476 3.6776 3.9774 3.9544 3.9817 3.8110 3.9602 4.0479 3.7858 3.9879 3.9588 3.9309 3.8973 3.9150 1.0157 1.0285 1.0160 1.0056 1.0064 1.0083 1.0032 1.0037 1.0055 1.0278 1.0055 1.0112 0.9994 1.0139 1.0080 1.0141 0.9985 0.9999 0.9989
dispcorr: -0.033489549 hartree
energy: -1928.189986840693
dipole: -13.37558 11.76268 -1.61290 6.51763 -6.73363 -0.21600 -32.73450 32.95394 0.21944
magnitude: 1.64203 au
magnitude: 4.17371 debye
