program: Orca
programVersion: 5.0.2
elementType: Cl F F F O O O N C C C C C C C C C C C C C C C C C C C C C C C H H H H H H H H H H H H H H H H H H H
charge: 0
multiplicity: 1
keywords: wb97x-d3
keywords: def2-TZVPP
keywords: def2/J RIJCOSX
keywords: DEFGRID2
keywords: scfconv7
keywords: smallprint printgap noloewdin
keywords: NOSOSCF
formula: C23H19ClF3NO3
InChI: InChI=1/C23H19ClF3NO3/c1-22(2)17(12-19(24)23(25,26)27)20(22)21(29)31-18(13-28)14-7-6-10-16(11-14)30-15-8-4-3-5-9-15/h3-12,17-18,20H,1-2H3
50 atoms
Cl -3.436738 4.817756 -1.780823
F  -4.137674 1.038056 -2.298215
F  -4.887074 2.741142 -3.382291
F  -5.332621 2.520743 -1.292057
O  1.077488 1.413909 1.219716
O  -0.274239 0.457228 -0.28038
O  2.426057 -4.313227 0.413979
N  1.933153 0.748256 4.3438
C  0.590317 2.936897 -2.022206
C  -0.724483 3.309461 -1.398632
C  0.399517 2.754788 -0.532029
C  0.696638 1.751692 -2.949825
C  1.488037 4.083674 -2.424304
C  -1.954349 2.563442 -1.679113
C  0.331419 1.421328 0.098534
C  -3.144364 3.120014 -1.873609
C  1.163366 0.178226 1.912811
C  -4.382987 2.345372 -2.211802
C  2.146356 -0.774157 1.272161
C  1.596924 0.517915 3.270147
C  1.809289 -2.11021 1.137744
C  3.388074 -0.314857 0.847459
C  2.728951 -2.998354 0.591872
C  4.284413 -1.204178 0.280498
C  3.965179 -2.548506 0.157398
C  1.983429 -5.058225 1.47053
C  1.18118 -6.150259 1.167931
C  2.34447 -4.791598 2.785337
C  0.742448 -6.979633 2.186784
C  1.890384 -5.627875 3.794798
C  1.090274 -6.722085 3.505158
H  -0.873829 4.372387 -1.251115
H  0.888636 3.495666 0.089182
H  0.403477 2.051348 -3.956942
H  1.729859 1.404824 -2.995947
H  0.083674 0.902507 -2.663611
H  1.235842 4.43085 -3.427301
H  1.397094 4.93396 -1.747827
H  2.534072 3.773811 -2.431231
H  -1.896329 1.486693 -1.750133
H  0.179349 -0.297223 1.980432
H  0.834604 -2.465291 1.450626
H  3.656956 0.72726 0.96032
H  5.250931 -0.853457 -0.055284
H  4.666834 -3.250204 -0.273469
H  0.91201 -6.345021 0.138139
H  2.979622 -3.949694 3.028203
H  0.118487 -7.830223 1.946456
H  2.174508 -5.419681 4.817846
H  0.743255 -7.36953 4.298685
totalener: -1928.16375690 hartree
nucrepener: 3072.19265411 hartree
electener: -5000.35641101 hartree
oneelecener: -8751.15177497 hartree
twoeener: 3750.79536395 hartree
kineticenergy: 1921.67219275 hartree
xcener: -157.120024388486 hartree
chargesum: 0.0000000
charge: -0.057325 -0.165910 -0.161708 -0.160582 -0.268368 -0.379480 -0.298138 0.002587 0.058113 0.052895 -0.095870 -0.248615 -0.230645 -0.190897 0.350337 -0.079984 0.313863 0.505842 0.059912 -0.251143 -0.143466 -0.187740 0.181454 -0.104129 -0.165409 0.242191 -0.213812 -0.155388 -0.087220 -0.124526 -0.147946 0.082568 0.094640 0.098220 0.091001 0.102445 0.096228 0.076985 0.091013 0.147918 0.122557 0.117791 0.127109 0.129728 0.131557 0.126036 0.133106 0.126104 0.129601 0.126499
qa: -0.0573 -0.1659 -0.1617 -0.1606 -0.2684 -0.3795 -0.2981 0.0026 0.0581 0.0529 -0.0959 -0.2486 -0.2306 -0.1909 0.3503 -0.0800 0.3139 0.5058 0.0599 -0.2511 -0.1435 -0.1877 0.1815 -0.1041 -0.1654 0.2422 -0.2138 -0.1554 -0.0872 -0.1245 -0.1479 0.0826 0.0946 0.0982 0.0910 0.1024 0.0962 0.0770 0.0910 0.1479 0.1226 0.1178 0.1271 0.1297 0.1316 0.1260 0.1331 0.1261 0.1296 0.1265
va: 1.2805 1.1390 1.1425 1.1457 2.1289 2.1102 2.1056 3.1190 3.7995 3.7470 3.9022 3.9115 3.9117 3.8822 4.1593 4.0536 3.8383 4.4850 3.6215 4.0143 4.0075 4.0076 3.9031 3.9449 4.0325 3.7981 4.0310 3.9157 3.9402 3.9660 3.9634 1.0389 1.0298 1.0010 1.0028 1.0186 1.0036 1.0085 1.0047 1.0318 1.0222 1.0137 1.0184 0.9995 1.0094 1.0141 1.0059 0.9985 0.9997 1.0002
dispcorr: -0.024357217 hartree
energy: -1928.188114118924
dipole: 43.47506 -42.12199 1.35307 -22.14523 22.09182 -0.05341 7.23295 -8.15456 -0.92161
magnitude: 1.63800 au
magnitude: 4.16345 debye
