program: Orca
programVersion: 5.0.2
elementType: Cl F F F O O O N C C C C C C C C C C C C C C C C C C C C C C C H H H H H H H H H H H H H H H H H H H
charge: 0
multiplicity: 1
keywords: wb97x-d3
keywords: def2-TZVPP
keywords: def2/J RIJCOSX
keywords: DEFGRID2
keywords: scfconv7
keywords: smallprint printgap noloewdin
keywords: NOSOSCF
formula: C23H19ClF3NO3
InChI: InChI=1/C23H19ClF3NO3/c1-22(2)17(12-19(24)23(25,26)27)20(22)21(29)31-18(13-28)14-7-6-10-16(11-14)30-15-8-4-3-5-9-15/h3-12,17-18,20H,1-2H3
50 atoms
Cl -3.139247 2.844637 1.700341
F  -3.240709 -0.136326 1.804393
F  -2.77203 -0.474711 -0.27243
F  -4.562331 0.590315 0.277963
O  2.331195 1.913767 0.624985
O  1.303808 1.011894 -1.138931
O  0.125558 -3.471406 0.478264
N  4.506651 -0.287813 -0.817901
C  -0.098225 3.72706 -1.562513
C  -0.778029 3.231849 -0.315219
C  0.752987 3.240802 -0.425399
C  -0.212321 2.982682 -2.871162
C  -0.099382 5.227982 -1.749777
C  -1.512539 1.964836 -0.262667
C  1.463599 1.945141 -0.405083
C  -2.528046 1.709376 0.554094
C  2.848595 0.636105 0.978395
C  -3.275895 0.409942 0.586858
C  1.746491 -0.316295 1.389532
C  3.744352 0.114224 -0.05883
C  1.501145 -1.49602 0.70292
C  0.947931 0.056295 2.462764
C  0.443168 -2.306597 1.096098
C  -0.114263 -0.753573 2.833372
C  -0.373422 -1.930639 2.156362
C  0.948841 -3.941272 -0.513824
C  2.039017 -4.729749 -0.180158
C  0.665394 -3.637198 -1.835466
C  2.854572 -5.220994 -1.187907
C  1.487982 -4.134474 -2.835417
C  2.583556 -4.922708 -2.515418
H  -1.160569 4.000517 0.345053
H  1.229707 4.004796 0.177968
H  -1.118248 3.303435 -3.387451
H  0.636586 3.22518 -3.51155
H  -0.241161 1.902895 -2.776306
H  0.755706 5.540888 -2.351299
H  -1.006703 5.549193 -2.26344
H  -0.050439 5.761862 -0.799636
H  -1.207282 1.16788 -0.927064
H  3.478953 0.846893 1.846341
H  2.117567 -1.768096 -0.143779
H  1.137795 0.977465 2.999062
H  -0.748814 -0.465106 3.660106
H  -1.203417 -2.563676 2.439961
H  2.242668 -4.955375 0.858788
H  -0.188018 -3.015545 -2.073655
H  3.707237 -5.835937 -0.932551
H  1.274063 -3.897788 -3.869204
H  3.225102 -5.303269 -3.298503
totalener: -1928.15896432 hartree
nucrepener: 3351.49605866 hartree
electener: -5279.65502299 hartree
oneelecener: -9310.74716421 hartree
twoeener: 4031.09214123 hartree
kineticenergy: 1921.68761381 hartree
xcener: -157.124353759532 hartree
chargesum: 0.0000000
charge: -0.059879 -0.166658 -0.169575 -0.161677 -0.273420 -0.364780 -0.294000 0.007730 0.074131 0.034456 -0.055996 -0.241658 -0.236701 -0.192836 0.335217 -0.085730 0.405729 0.531722 -0.079132 -0.293222 -0.101704 -0.241916 0.271152 -0.089981 -0.219783 0.186634 -0.140585 -0.136801 -0.125230 -0.122130 -0.105553 0.079381 0.088524 0.091487 0.092868 0.099626 0.095635 0.094963 0.074585 0.144591 0.126131 0.127271 0.114364 0.128214 0.126586 0.125497 0.124491 0.126339 0.125444 0.126180
qa: -0.0599 -0.1667 -0.1696 -0.1617 -0.2734 -0.3648 -0.2940 0.0077 0.0741 0.0345 -0.0560 -0.2417 -0.2367 -0.1928 0.3352 -0.0857 0.4057 0.5317 -0.0791 -0.2932 -0.1017 -0.2419 0.2712 -0.0900 -0.2198 0.1866 -0.1406 -0.1368 -0.1252 -0.1221 -0.1056 0.0794 0.0885 0.0915 0.0929 0.0996 0.0956 0.0950 0.0746 0.1446 0.1261 0.1273 0.1144 0.1282 0.1266 0.1255 0.1245 0.1263 0.1254 0.1262
va: 1.2777 1.1330 1.1338 1.1462 2.1162 2.1208 2.1210 3.1191 3.8108 3.7727 3.8663 3.9016 3.9072 3.8826 4.1603 4.0429 3.8993 4.4437 3.7621 4.0559 3.8440 3.9897 3.8422 3.9076 3.9988 3.8726 4.0018 3.9983 3.9584 3.9566 3.9422 1.0369 1.0293 1.0007 1.0026 1.0231 1.0040 1.0045 1.0076 1.0244 0.9911 1.0267 1.0165 1.0010 1.0157 1.0073 1.0100 1.0002 1.0005 1.0002
dispcorr: -0.028986536 hartree
energy: -1928.187950858291
dipole: 26.03391 -26.00784 0.02607 4.19162 -2.93901 1.25262 -17.74668 18.01923 0.27254
magnitude: 1.28219 au
magnitude: 3.25906 debye
