program: Orca
programVersion: 5.0.2
elementType: Cl F F F O O O N C C C C C C C C C C C C C C C C C C C C C C C H H H H H H H H H H H H H H H H H H H
charge: 0
multiplicity: 1
keywords: wb97x-d3
keywords: def2-TZVPP
keywords: def2/J RIJCOSX
keywords: DEFGRID2
keywords: scfconv7
keywords: smallprint printgap noloewdin
keywords: NOSOSCF
formula: C23H19ClF3NO3
InChI: InChI=1/C23H19ClF3NO3/c1-22(2)17(12-19(24)23(25,26)27)20(22)21(29)31-18(13-28)14-7-6-10-16(11-14)30-15-8-4-3-5-9-15/h3-12,17-18,20H,1-2H3
50 atoms
Cl -3.39821 4.432872 -3.075638
F  -1.667377 6.660731 -2.064726
F  -0.752669 5.703729 -3.75482
F  0.109922 5.476272 -1.793371
O  0.046109 -0.716422 -1.377942
O  0.564134 1.291957 -0.544784
O  0.766463 -4.22188 2.32178
N  1.749293 -2.956372 -3.114792
C  -2.503335 1.446731 0.052674
C  -2.339625 2.092334 -1.293677
C  -1.723002 0.723015 -1.021733
C  -1.824875 2.018274 1.273269
C  -3.865385 0.866837 0.355109
C  -1.524498 3.294069 -1.500703
C  -0.263612 0.515394 -0.937923
C  -1.891536 4.33487 -2.240393
C  1.416886 -1.093878 -1.312008
C  -1.041462 5.551156 -2.460978
C  1.796489 -1.601133 0.057944
C  1.586974 -2.137375 -2.326292
C  1.139787 -2.70434 0.58657
C  2.798641 -0.970052 0.778664
C  1.487661 -3.175266 1.843308
C  3.145774 -1.456002 2.030391
C  2.497476 -2.552967 2.571714
C  1.339987 -5.121567 3.177823
C  2.545197 -5.744308 2.87916
C  0.644135 -5.443761 4.332424
C  3.050583 -6.694588 3.752477
C  1.156573 -6.403388 5.192776
C  2.361525 -7.028156 4.910128
H  -3.21136 2.032761 -1.934546
H  -2.243839 -0.099552 -1.49704
H  -2.460629 2.789496 1.710102
H  -1.686714 1.239627 2.024805
H  -0.852064 2.459343 1.080281
H  -4.523626 1.6325 0.767952
H  -4.346993 0.46109 -0.5350
H  -3.787126 0.061621 1.087188
H  -0.554883 3.343118 -1.025034
H  2.060774 -0.2515 -1.583854
H  0.361492 -3.21239 0.029741
H  3.29922 -0.10124 0.372509
H  3.924709 -0.967574 2.600059
H  2.771412 -2.916034 3.553666
H  3.078651 -5.4980 1.969737
H  -0.29609 -4.952133 4.544632
H  3.986799 -7.184142 3.51895
H  0.610086 -6.659156 6.090832
H  2.759358 -7.775038 5.583595
totalener: -1928.16469963 hartree
nucrepener: 3039.45914855 hartree
electener: -4967.62384818 hartree
oneelecener: -8685.77757274 hartree
twoeener: 3718.15372455 hartree
kineticenergy: 1921.65955731 hartree
xcener: -157.117397033103 hartree
chargesum: 0.0000000
charge: -0.057510 -0.161817 -0.160792 -0.166041 -0.265907 -0.391986 -0.296512 0.001236 0.058746 0.043954 -0.097711 -0.247339 -0.231449 -0.192879 0.368352 -0.078061 0.334071 0.504448 0.013012 -0.259725 -0.201382 -0.127656 0.192472 -0.114635 -0.145551 0.217477 -0.149147 -0.193942 -0.119181 -0.100162 -0.133629 0.083333 0.093159 0.095853 0.093897 0.102254 0.095220 0.076036 0.093566 0.152345 0.120424 0.123093 0.114311 0.131275 0.135965 0.138139 0.125750 0.129619 0.127030 0.127980
qa: -0.0575 -0.1618 -0.1608 -0.1660 -0.2659 -0.3920 -0.2965 0.0012 0.0587 0.0440 -0.0977 -0.2473 -0.2314 -0.1929 0.3684 -0.0781 0.3341 0.5044 0.0130 -0.2597 -0.2014 -0.1277 0.1925 -0.1146 -0.1456 0.2175 -0.1491 -0.1939 -0.1192 -0.1002 -0.1336 0.0833 0.0932 0.0959 0.0939 0.1023 0.0952 0.0760 0.0936 0.1523 0.1204 0.1231 0.1143 0.1313 0.1360 0.1381 0.1257 0.1296 0.1270 0.1280
va: 1.2804 1.1431 1.1445 1.1387 2.1418 2.0968 2.1057 3.1176 3.7952 3.7593 3.9153 3.9125 3.9141 3.8757 4.1391 4.0491 3.8218 4.4870 3.6695 4.0228 4.0768 3.9977 3.9002 3.9702 3.9345 3.8199 3.9511 4.0332 3.9453 3.9412 3.9525 1.0376 1.0301 1.0018 1.0014 1.0172 1.0039 1.0088 1.0042 1.0298 1.0194 1.0296 1.0158 1.0010 1.0034 1.0016 1.0128 0.9996 0.9990 0.9997
dispcorr: -0.023987203 hartree
energy: -1928.188686834581
dipole: 5.65761 -5.96406 -0.30645 -46.40560 45.69896 -0.70665 38.19451 -36.06374 2.13077
magnitude: 2.26571 au
magnitude: 5.75899 debye
