program: Orca
programVersion: 5.0.2
elementType: Cl F F F O O O N C C C C C C C C C C C C C C C C C C C C C C C H H H H H H H H H H H H H H H H H H H
charge: 0
multiplicity: 1
keywords: wb97x-d3
keywords: def2-TZVPP
keywords: def2/J RIJCOSX
keywords: DEFGRID2
keywords: scfconv7
keywords: smallprint printgap noloewdin
keywords: NOSOSCF
formula: C23H19ClF3NO3
InChI: InChI=1/C23H19ClF3NO3/c1-22(2)17(12-19(24)23(25,26)27)20(22)21(29)31-18(13-28)14-7-6-10-16(11-14)30-15-8-4-3-5-9-15/h3-12,17-18,20H,1-2H3
50 atoms
Cl -3.157466 4.596271 -2.563307
F  -5.136431 2.326556 -2.458777
F  -3.70674 0.767494 -2.860049
F  -4.052731 2.319547 -4.312477
O  0.790521 1.285683 1.633355
O  -0.368325 0.364157 -0.039841
O  2.781335 -4.262661 0.586464
N  1.611433 0.372496 4.706158
C  0.714349 2.962985 -1.491276
C  -0.734534 3.211536 -1.174666
C  0.197904 2.701946 -0.090221
C  1.114491 1.822466 -2.395031
C  1.59313 4.180655 -1.646739
C  -1.806632 2.401396 -1.764449
C  0.140776 1.331478 0.454235
C  -2.869146 2.904736 -2.381692
C  0.963415 -0.001736 2.202138
C  -3.947602 2.070232 -3.00557
C  2.042587 -0.798222 1.50227
C  1.327051 0.228404 3.602566
C  1.880681 -2.167708 1.368058
C  3.187718 -0.170993 1.031013
C  2.882831 -2.921922 0.769183
C  4.165419 -0.930912 0.408388
C  4.024711 -2.302245 0.27981
C  2.081104 -5.019969 1.48666
C  1.140367 -5.908566 0.991323
C  2.338435 -4.944965 2.849831
C  0.453415 -6.7335 1.869982
C  1.637065 -5.766898 3.717207
C  0.693863 -6.663062 3.233635
H  -0.992872 4.255692 -1.042187
H  0.478972 3.443738 0.648192
H  2.145377 1.526428 -2.194267
H  0.497093 0.934874 -2.293133
H  1.059289 2.146289 -3.435105
H  1.567151 4.540825 -2.676085
H  1.277241 5.000485 -1.001015
H  2.629703 3.94343 -1.401801
H  -1.730153 1.324927 -1.70598
H  0.023164 -0.563327 2.185371
H  0.975332 -2.645277 1.722668
H  3.322852 0.8959 1.147675
H  5.059444 -0.452142 0.031994
H  4.792039 -2.898548 -0.19576
H  0.956353 -5.954246 -0.073921
H  3.081459 -4.255866 3.230972
H  -0.278542 -7.42985 1.483043
H  1.836934 -5.709356 4.778896
H  0.153041 -7.304374 3.91618
totalener: -1928.16337930 hartree
nucrepener: 3089.91926747 hartree
electener: -5018.08264677 hartree
oneelecener: -8786.61968780 hartree
twoeener: 3768.53704103 hartree
kineticenergy: 1921.67556958 hartree
xcener: -157.121068561770 hartree
chargesum: 0.0000000
charge: -0.059076 -0.161040 -0.165630 -0.162213 -0.266744 -0.375836 -0.296267 0.001560 0.058454 0.037328 -0.085621 -0.243545 -0.228539 -0.187553 0.328587 -0.075519 0.306715 0.504326 0.072088 -0.250006 -0.149086 -0.214641 0.207751 -0.089603 -0.188281 0.221749 -0.197553 -0.157114 -0.095303 -0.114231 -0.137963 0.084382 0.095057 0.088190 0.101557 0.100703 0.095840 0.077044 0.090403 0.154681 0.124447 0.113268 0.125994 0.128101 0.130633 0.127924 0.137141 0.127831 0.131366 0.128243
qa: -0.0591 -0.1610 -0.1656 -0.1622 -0.2667 -0.3758 -0.2963 0.0016 0.0585 0.0373 -0.0856 -0.2435 -0.2285 -0.1876 0.3286 -0.0755 0.3067 0.5043 0.0721 -0.2500 -0.1491 -0.2146 0.2078 -0.0896 -0.1883 0.2217 -0.1976 -0.1571 -0.0953 -0.1142 -0.1380 0.0844 0.0951 0.0882 0.1016 0.1007 0.0958 0.0770 0.0904 0.1547 0.1244 0.1133 0.1260 0.1281 0.1306 0.1279 0.1371 0.1278 0.1314 0.1282
va: 1.2786 1.1454 1.1391 1.1416 2.1221 2.1085 2.1125 3.1209 3.8087 3.7743 3.8940 3.9097 3.9102 3.8698 4.1837 4.0394 3.8385 4.4879 3.6528 4.0076 3.9850 4.0031 3.8791 3.9438 4.0324 3.8163 4.0384 3.9571 3.9338 3.9477 3.9574 1.0370 1.0292 1.0052 1.0173 1.0024 1.0041 1.0087 1.0047 1.0311 1.0212 1.0154 1.0185 0.9992 1.0109 1.0125 1.0022 0.9988 0.9992 0.9998
dispcorr: -0.025041540 hartree
energy: -1928.188420836449
dipole: 40.73726 -39.55213 1.18513 -19.04414 18.99261 -0.05153 16.21015 -16.73525 -0.52510
magnitude: 1.29727 au
magnitude: 3.29741 debye
