program: Orca
programVersion: 5.0.2
elementType: Cl F F F O O O N C C C C C C C C C C C C C C C C C C C C C C C H H H H H H H H H H H H H H H H H H H
charge: 0
multiplicity: 1
keywords: wb97x-d3
keywords: def2-TZVPP
keywords: def2/J RIJCOSX
keywords: DEFGRID2
keywords: scfconv7
keywords: smallprint printgap noloewdin
keywords: NOSOSCF
formula: C23H19ClF3NO3
InChI: InChI=1/C23H19ClF3NO3/c1-22(2)17(12-19(24)23(25,26)27)20(22)21(29)31-18(13-28)14-7-6-10-16(11-14)30-15-8-4-3-5-9-15/h3-12,17-18,20H,1-2H3
50 atoms
Cl -3.708221 3.740494 -1.799023
F  -4.102617 0.647147 0.510362
F  -5.461175 1.431002 -0.964368
F  -4.905312 2.634295 0.726422
O  2.094556 1.429422 0.159478
O  0.207292 0.237705 0.252769
O  2.415124 -4.221495 0.490297
N  4.45973 2.109823 2.36854
C  -0.147474 1.352123 -2.659075
C  -0.962154 2.249201 -1.770565
C  0.486745 1.942503 -1.417531
C  -0.462138 -0.120497 -2.757306
C  0.319835 1.943147 -3.968122
C  -2.091787 1.73973 -0.986132
C  0.863411 1.103378 -0.26235
C  -3.293481 2.302769 -0.942557
C  2.641401 0.634551 1.21076
C  -4.44542 1.74842 -0.158807
C  3.225129 -0.6509 0.67659
C  3.659939 1.471333 1.84772
C  2.530362 -1.836682 0.8800
C  4.40896 -0.636935 -0.046826
C  3.030672 -3.020745 0.353669
C  4.89781 -1.826593 -0.564746
C  4.218411 -3.015453 -0.370005
C  1.288852 -4.310295 1.269155
C  0.041087 -4.206996 0.675411
C  1.414217 -4.533607 2.631456
C  -1.096176 -4.338121 1.458451
C  0.270436 -4.662741 3.404912
C  -0.985045 -4.564493 2.822448
H  -1.097787 3.257712 -2.143289
H  1.175325 2.75949 -1.596875
H  0.418162 -0.669856 -3.094225
H  -0.790103 -0.569906 -1.825027
H  -1.250415 -0.272891 -3.495911
H  -0.448063 1.82797 -4.734551
H  0.544867 3.006698 -3.883113
H  1.221636 1.438966 -4.318687
H  -1.946646 0.840399 -0.40469
H  1.875142 0.413785 1.960096
H  1.599697 -1.825322 1.431105
H  4.954984 0.285786 -0.195962
H  5.824219 -1.829598 -1.123069
H  4.600533 -3.94507 -0.770726
H  -0.034844 -4.031391 -0.389737
H  2.397278 -4.612636 3.077478
H  -2.07246 -4.260104 0.999034
H  0.362801 -4.841574 4.467883
H  -1.874204 -4.667127 3.429534
totalener: -1928.16488728 hartree
nucrepener: 3167.64616452 hartree
electener: -5095.81105180 hartree
oneelecener: -8942.17433605 hartree
twoeener: 3846.36328425 hartree
kineticenergy: 1921.68077197 hartree
xcener: -157.121902695177 hartree
chargesum: 0.0000000
charge: -0.057773 -0.166916 -0.162170 -0.160997 -0.254462 -0.407916 -0.294363 -0.000522 0.060639 0.044235 -0.109699 -0.250150 -0.231599 -0.192759 0.395455 -0.077084 0.316905 0.503740 -0.034169 -0.257842 -0.120957 -0.184497 0.242322 -0.089497 -0.198637 0.191647 -0.140770 -0.143709 -0.121414 -0.130339 -0.110298 0.084402 0.093924 0.095619 0.096265 0.098549 0.095507 0.076695 0.093119 0.154274 0.120727 0.119274 0.120447 0.128888 0.126714 0.122098 0.129742 0.128332 0.129407 0.129612
qa: -0.0578 -0.1669 -0.1622 -0.1610 -0.2545 -0.4079 -0.2944 -0.0005 0.0606 0.0442 -0.1097 -0.2501 -0.2316 -0.1928 0.3955 -0.0771 0.3169 0.5037 -0.0342 -0.2578 -0.1210 -0.1845 0.2423 -0.0895 -0.1986 0.1916 -0.1408 -0.1437 -0.1214 -0.1303 -0.1103 0.0844 0.0939 0.0956 0.0963 0.0985 0.0955 0.0767 0.0931 0.1543 0.1207 0.1193 0.1204 0.1289 0.1267 0.1221 0.1297 0.1283 0.1294 0.1296
va: 1.2802 1.1372 1.1409 1.1460 2.1482 2.0724 2.1202 3.1175 3.8020 3.7489 3.9306 3.9165 3.9124 3.8664 4.1104 4.0440 3.8301 4.4864 3.7100 4.0146 3.8828 4.0484 3.8686 3.9490 4.0432 3.8549 4.0020 3.9970 3.9533 3.9496 3.9372 1.0366 1.0295 1.0014 1.0161 1.0021 1.0035 1.0088 1.0042 1.0310 1.0190 1.0324 1.0162 0.9994 1.0137 1.0096 1.0066 1.0000 0.9997 0.9994
dispcorr: -0.025241307 hartree
energy: -1928.190128586632
dipole: 33.43604 -33.22426 0.21178 -24.11540 23.19742 -0.91798 -9.40495 8.17715 -1.22781
magnitude: 1.54759 au
magnitude: 3.93366 debye
