program: Orca
programVersion: 5.0.2
elementType: Cl F F F O O O N C C C C C C C C C C C C C C C C C C C C C C C H H H H H H H H H H H H H H H H H H H
charge: 0
multiplicity: 1
keywords: wb97x-d3
keywords: def2-TZVPP
keywords: def2/J RIJCOSX
keywords: DEFGRID2
keywords: scfconv7
keywords: smallprint printgap noloewdin
keywords: NOSOSCF
formula: C23H19ClF3NO3
InChI: InChI=1/C23H19ClF3NO3/c1-22(2)17(12-19(24)23(25,26)27)20(22)21(29)31-18(13-28)14-7-6-10-16(11-14)30-15-8-4-3-5-9-15/h3-12,17-18,20H,1-2H3
50 atoms
Cl -3.795264 0.304329 -0.485857
F  -3.225014 0.155209 -3.470126
F  -2.543186 -1.590052 -2.414499
F  -1.115322 -0.208502 -3.244443
O  2.205351 1.537341 1.375092
O  1.653447 1.984607 -0.738704
O  0.91285 -3.317006 0.573568
N  5.03231 2.517801 -0.281902
C  -0.87202 3.368608 0.4464
C  -1.25512 1.916705 0.373447
C  0.060597 2.337604 1.028879
C  -0.536501 4.136874 -0.807829
C  -1.617831 4.199206 1.465051
C  -1.276437 1.183482 -0.895547
C  1.352716 1.961465 0.42139
C  -2.302665 0.468156 -1.339499
C  3.385293 0.888243 0.92707
C  -2.292547 -0.295334 -2.629487
C  3.0785 -0.385048 0.165879
C  4.274523 1.810304 0.212122
C  2.137544 -1.243066 0.728495
C  3.710542 -0.716323 -1.018803
C  1.82201 -2.432097 0.088486
C  3.401071 -1.921664 -1.636862
C  2.461081 -2.778469 -1.098523
C  0.051875 -2.898789 1.556128
C  0.302798 -3.253233 2.871806
C  -1.067336 -2.150573 1.220123
C  -0.580707 -2.851711 3.863769
C  -1.941343 -1.752594 2.220016
C  -1.698589 -2.096357 3.542881
H  -2.004423 1.598871 1.088951
H  0.056101 2.25972 2.109517
H  -0.021695 3.553475 -1.564072
H  -1.457043 4.521123 -1.24927
H  0.097001 4.991446 -0.566889
H  -2.551466 4.573502 1.043116
H  -1.864591 3.62885 2.361379
H  -1.020591 5.059117 1.772072
H  -0.395159 1.217093 -1.52228
H  3.902565 0.628543 1.855158
H  1.649518 -0.981374 1.658771
H  4.426856 -0.044952 -1.472333
H  3.889192 -2.185396 -2.565385
H  2.209686 -3.709387 -1.588955
H  1.177609 -3.843437 3.111917
H  -1.260619 -1.898344 0.185475
H  -0.39105 -3.130752 4.891764
H  -2.81977 -1.178813 1.95669
H  -2.385159 -1.787223 4.319516
totalener: -1928.16088701 hartree
nucrepener: 3387.82076310 hartree
electener: -5315.98165011 hartree
oneelecener: -9382.51983304 hartree
twoeener: 4066.53818294 hartree
kineticenergy: 1921.68131399 hartree
xcener: -157.125169690544 hartree
chargesum: 0.0000000
charge: -0.063921 -0.160117 -0.163404 -0.163291 -0.283107 -0.367266 -0.296301 0.004679 0.069363 0.042554 -0.062644 -0.245298 -0.232287 -0.190655 0.336543 -0.103178 0.438729 0.519946 -0.051486 -0.288602 -0.253199 -0.153734 0.251082 -0.068450 -0.201085 0.195916 -0.147351 -0.121204 -0.132491 -0.158114 -0.113537 0.073420 0.092209 0.106576 0.092634 0.094916 0.095538 0.074123 0.095685 0.163300 0.121801 0.124282 0.120707 0.129053 0.127526 0.127818 0.142881 0.128258 0.122486 0.128701
qa: -0.0639 -0.1601 -0.1634 -0.1633 -0.2831 -0.3673 -0.2963 0.0047 0.0694 0.0426 -0.0626 -0.2453 -0.2323 -0.1907 0.3365 -0.1032 0.4387 0.5199 -0.0515 -0.2886 -0.2532 -0.1537 0.2511 -0.0684 -0.2011 0.1959 -0.1474 -0.1212 -0.1325 -0.1581 -0.1135 0.0734 0.0922 0.1066 0.0926 0.0949 0.0955 0.0741 0.0957 0.1633 0.1218 0.1243 0.1207 0.1291 0.1275 0.1278 0.1429 0.1283 0.1225 0.1287
va: 1.2735 1.1473 1.1361 1.1436 2.1114 2.1097 2.1253 3.1157 3.8684 3.7709 3.9108 3.9128 3.9053 3.8003 4.1235 4.0281 3.8974 4.4646 3.8199 4.0569 3.9318 3.9954 3.8455 3.9560 4.0471 3.8758 3.9723 3.9320 3.9529 3.9510 3.9701 1.0339 1.0293 1.0182 1.0016 1.0027 1.0045 1.0083 1.0044 1.0263 0.9867 1.0294 1.0246 0.9994 1.0129 1.0098 1.0076 0.9994 1.0209 0.9998
dispcorr: -0.030011078 hartree
energy: -1928.190898088886
dipole: 12.42380 -13.22927 -0.80546 13.53946 -13.49986 0.03960 24.54548 -22.75797 1.78751
magnitude: 1.96100 au
magnitude: 4.98447 debye
