program: Orca
programVersion: 5.0.2
elementType: Cl F F F O O O N C C C C C C C C C C C C C C C C C C C C C C C H H H H H H H H H H H H H H H H H H H
charge: 0
multiplicity: 1
keywords: wb97x-d3
keywords: def2-TZVPP
keywords: def2/J RIJCOSX
keywords: DEFGRID2
keywords: scfconv7
keywords: smallprint printgap noloewdin
keywords: NOSOSCF
formula: C23H19ClF3NO3
InChI: InChI=1/C23H19ClF3NO3/c1-22(2)17(12-19(24)23(25,26)27)20(22)21(29)31-18(13-28)14-7-6-10-16(11-14)30-15-8-4-3-5-9-15/h3-12,17-18,20H,1-2H3
50 atoms
Cl -3.041782 5.094227 -2.385823
F  -5.404938 3.309952 -2.003122
F  -4.842281 4.17728 -0.12178
F  -4.538463 2.07264 -0.468529
O  1.734605 1.633804 0.443981
O  -0.375136 0.922171 0.262244
O  0.982828 -4.00103 1.939444
N  4.065555 1.523144 2.795494
C  0.069993 1.977221 -2.684941
C  -0.735962 3.026647 -1.972744
C  0.530604 2.480962 -1.33273
C  -0.463825 0.575244 -2.848772
C  0.892041 2.440023 -3.864561
C  -2.076797 2.755714 -1.444528
C  0.525484 1.601146 -0.147309
C  -3.117028 3.56999 -1.580397
C  1.928269 0.727645 1.519551
C  -4.484139 3.276472 -1.038301
C  2.120836 -0.69145 1.037325
C  3.126825 1.193696 2.22157
C  1.471609 -1.725222 1.689401
C  2.969853 -0.955109 -0.030526
C  1.672448 -3.036012 1.277327
C  3.147369 -2.264407 -0.444689
C  2.505786 -3.310511 0.200298
C  1.55143 -5.2336 2.113104
C  2.840959 -5.373022 2.611238
C  0.779488 -6.347958 1.825534
C  3.355713 -6.643661 2.812175
C  1.304091 -7.614058 2.040342
C  2.593059 -7.767683 2.527643
H  -0.605708 4.032594 -2.353794
H  1.375478 3.159058 -1.358478
H  -1.081986 0.524326 -3.746055
H  0.361667 -0.126974 -2.9749
H  -1.062934 0.223197 -2.014332
H  1.269639 3.454112 -3.730583
H  1.749197 1.782929 -4.019088
H  0.292791 2.427643 -4.776066
H  -2.239657 1.831403 -0.908949
H  1.087038 0.770168 2.219417
H  0.80139 -1.526763 2.516607
H  3.490928 -0.151062 -0.533449
H  3.798621 -2.479688 -1.281119
H  2.654318 -4.32867 -0.134513
H  3.436056 -4.499246 2.844699
H  -0.224656 -6.218851 1.443746
H  4.359244 -6.753221 3.201363
H  0.700543 -8.484018 1.818104
H  3.000124 -8.756412 2.689628
totalener: -1928.16346662 hartree
nucrepener: 3055.68611912 hartree
electener: -4983.84958574 hartree
oneelecener: -8718.18344712 hartree
twoeener: 3734.33386138 hartree
kineticenergy: 1921.67803430 hartree
xcener: -157.121008683304 hartree
chargesum: -0.0000000
charge: -0.058881 -0.162242 -0.160898 -0.165729 -0.266059 -0.377290 -0.296283 0.001698 0.055698 0.046944 -0.081491 -0.246690 -0.231443 -0.187268 0.335618 -0.080228 0.312168 0.505324 0.057920 -0.249892 -0.164955 -0.201037 0.182415 -0.114264 -0.130952 0.212939 -0.144600 -0.196133 -0.120677 -0.097707 -0.135804 0.083360 0.094286 0.098655 0.090553 0.101493 0.077183 0.091303 0.095988 0.150393 0.123271 0.109926 0.126334 0.130290 0.136478 0.136637 0.128307 0.129932 0.127507 0.127901
qa: -0.0589 -0.1622 -0.1609 -0.1657 -0.2661 -0.3773 -0.2963 0.0017 0.0557 0.0469 -0.0815 -0.2467 -0.2314 -0.1873 0.3356 -0.0802 0.3122 0.5053 0.0579 -0.2499 -0.1650 -0.2010 0.1824 -0.1143 -0.1310 0.2129 -0.1446 -0.1961 -0.1207 -0.0977 -0.1358 0.0834 0.0943 0.0987 0.0906 0.1015 0.0772 0.0913 0.0960 0.1504 0.1233 0.1099 0.1263 0.1303 0.1365 0.1366 0.1283 0.1299 0.1275 0.1279
va: 1.2789 1.1426 1.1444 1.1390 2.1277 2.1097 2.1058 3.1194 3.8106 3.7593 3.8860 3.9124 3.9109 3.8744 4.1805 4.0468 3.8340 4.4860 3.6503 4.0131 4.0838 4.0105 3.9304 3.9559 3.9298 3.8222 3.9428 4.0316 3.9489 3.9369 3.9535 1.0382 1.0295 1.0020 1.0034 1.0177 1.0086 1.0044 1.0037 1.0322 1.0201 1.0251 1.0193 1.0005 1.0026 1.0022 1.0123 0.9996 0.9988 0.9998
dispcorr: -0.024578497 hartree
energy: -1928.188045114778
dipole: 39.58843 -38.77220 0.81623 -39.48130 38.14705 -1.33425 -4.45617 3.05698 -1.39918
magnitude: 2.09861 au
magnitude: 5.33424 debye
