program: Gaussian 09
title: 000007275
version: EM64L-G09RevD.01
frameworkgroup: C1[X(C10H16O2)]
method: RPBEPBE
basis: SDD
operation: Freq
keyword: #pfreq=noraman
keyword: PBEPBE/SDD
title: #p freq=noraman PBEPBE/SDD
converged: YES YES NO NO
title: Mulliken charges:
elementType: O O C C C C C C C C C C H H H H H H H H H H H H H H H H
charge: -0.322300 -0.304586 0.414072 -0.187260 -0.047560 -0.479535 -0.144647 -0.488778 -0.459444 -0.076228 -0.769369 -0.701820 0.215968 0.225487 0.233545 0.232554 0.235825 0.199589 0.219782 0.231265 0.204826 0.219362 0.235923 0.213456 0.222821 0.230798 0.232656 0.213597
chargesum: 0.00000
title: Mulliken charges with hydrogens summed into heavy atoms:
elementType: O O C C C C C C C C C C
charge: -0.322300 -0.304586 0.414072 0.028708 0.177928 -0.013437 0.091178 -0.069407 -0.023353 0.143134 -0.097170 -0.024768
polarizability: 1.32164401e+02 -3.50112497e-02 1.02559672e+02 -5.32441911e-01 -1.15823620e+00 8.87379675e+01
1716.lowfreq: -17.0092 -0.0005 -0.0004 -0.0004 3.4829 19.4888 52.4187 60.6353 94.9214
frequency: 52.2005 60.5566 94.9088 161.8686 169.1993 192.4034 212.9522 245.6688 262.8358 290.5105 328.4452 379.4189 414.3686 434.2929 460.5090 480.6583 526.9413 608.4427 629.1475 696.7870 735.7610 794.7786 809.4586 823.1526 887.3532 911.0789 925.8805 963.6896 985.5747 1002.6504 1018.8705 1039.1904 1047.6710 1074.4026 1083.1446 1115.2823 1127.1352 1138.2661 1145.6527 1175.7890 1205.4516 1214.0851 1234.3915 1241.7107 1272.0767 1301.2655 1307.3138 1322.1612 1338.1579 1351.5850 1363.6794 1390.9806 1392.8701 1417.5706 1436.7016 1450.0014 1451.5770 1464.7692 1465.6226 1468.0556 1473.8814 1474.9255 2967.4071 2968.6413 2978.9009 2982.4739 2983.8612 2990.1701 3025.7796 3046.2387 3049.1571 3055.0523 3066.6347 3067.7456 3074.0042 3079.6655 3092.2239 3097.3782
redmass: 3.4470 3.7123 3.3989 1.7046 1.3618 1.1426 2.4030 4.0826 2.1361 2.7421 2.8237 2.4927 2.1197 3.9726 3.6649 4.1635 3.6356 3.4601 3.5704 4.9879 3.2020 4.1051 3.6063 2.0461 1.8764 1.9583 1.8498 2.0603 1.4075 1.2866 1.5697 1.4982 1.6870 2.0892 1.8481 1.5977 2.2454 2.2348 2.3447 1.4056 1.6099 1.4462 1.3496 1.3954 1.2922 1.2609 1.3349 1.3324 1.3571 1.9388 1.6602 1.2446 1.2446 2.3461 2.0381 1.0874 1.0787 1.0926 1.2322 1.1046 1.0991 1.1795 1.0817 1.0604 1.0380 1.0364 1.0621 1.0616 1.0986 1.0981 1.0969 1.0954 1.0981 1.0899 1.0976 1.0911 1.0988 1.0989
irintensity: 2.1060 2.7721 3.0321 1.0433 1.3093 0.6502 0.6292 1.3398 0.5300 2.5960 4.5120 3.9606 1.3080 15.3558 6.7496 4.6905 1.9267 3.8393 3.8607 10.3124 11.5864 12.1569 24.2183 9.7987 4.1653 1.6437 13.1180 13.4297 13.6976 4.8968 11.0099 2.7121 4.5668 5.6119 9.3994 5.9651 8.6996 1.6906 0.5890 2.2706 5.4154 6.6861 2.7437 4.6294 1.0672 4.6447 1.4798 10.1734 1.0670 4.3367 3.1204 19.1662 19.5405 7.5928 5.6520 4.9809 15.2070 8.9125 16.0967 11.1314 8.4761 6.1702 7.0495 25.5079 44.5312 22.1535 29.1067 27.8437 28.0048 3.0882 12.3268 37.8531 26.5066 26.2886 27.8290 45.4601 27.8979 44.0655
temp: 298.150 k
press: 1.00000 atm
elementType: 8 8 6 6 6 6 6 6 6 6 6 6 1 1 1 1 1 1 1 1 1 1 1 1 1 1 1 1
symmnumber: 1
zpe: 628464.5 jmol-1
zpe.correction: 0.239370 hartree
zpe.thermalcorrener: 0.251793 hartree
zpe.thermalcorrenthalpy: 0.252737 hartree
zpe.thermalcorrgfe: 0.200939 hartree
zpe.sumelectzpe: -540.088414 hartree
zpe.sumelectthermal: -540.075991 hartree
zpe.sumelectthermalent: -540.075046 hartree
zpe.sumelectthermalfe: -540.126844 hartree
dipole: -0.2249 2.6289 -1.3739
dipole: 2.9748
quadrupole: -73.8704 -72.8301 -74.9547
quadrupole: -5.4427 -8.9730 -0.7123
quadrupole: 0.0146 1.0550 -1.0696 -5.4427 -8.9730 -0.7123
hfenergy: -540.3277832 hartree
pointgroup: C01 [X(C10H16O2)]
dipole: -0.1049228 1.0480694 -0.5101807 debye
polarizability: 132.1252153|0.139517|102.6132711|-1.3952873|-0.7864517|88.7235542 unknown
InChI: InChI=1S/C10H16O2/c1-6-9(11-6)7-3-4-10(2)8(5-7)12-10/h6-9H,3-5H2,1-2H3
charge 0 multiplicity 1
28 atoms
O  2.505877 -0.549671 1.151667
O  -2.800991 -1.143824 -0.533969
C  2.457769 0.247215 -0.144622
C  1.834557 -1.122154 -0.091872
C  -0.499752 -0.037717 -0.174465
C  0.331099 -1.33611 0.014123
C  -1.918587 -0.248581 0.319439
C  1.548077 1.471714 -0.07834
C  0.168414 1.162893 0.544152
C  -3.117171 0.334895 -0.363634
C  3.8090 0.443787 -0.806604
C  -4.397772 0.660037 0.373461
H  2.413054 -1.953202 -0.520216
H  -0.546659 0.191991 -1.259742
H  0.121066 -1.7745 1.01044
H  0.005882 -2.08245 -0.733941
H  -2.014108 -0.467557 1.395502
H  1.414623 1.860467 -1.109189
H  2.060847 2.265157 0.500142
H  0.296956 0.928736 1.618278
H  -0.478713 2.058192 0.470752
H  -2.932662 0.903939 -1.287503
H  4.414512 -0.476044 -0.739545
H  3.689738 0.707883 -1.874561
H  4.371559 1.258765 -0.314523
H  -5.277785 0.499849 -0.275057
H  -4.507336 0.016707 1.263568
H  -4.401395 1.716982 0.70156
