program: Orca
programVersion: 5.0.2
elementType: Cl F F F O O O N C C C C C C C C C C C C C C C C C C C C C C C H H H H H H H H H H H H H H H H H H H
charge: 0
multiplicity: 1
keywords: wb97x-d3
keywords: def2-TZVPP
keywords: def2/J RIJCOSX
keywords: DEFGRID2
keywords: scfconv7
keywords: smallprint printgap noloewdin
keywords: NOSOSCF
formula: C23H19ClF3NO3
InChI: InChI=1/C23H19ClF3NO3/c1-22(2)17(12-19(24)23(25,26)27)20(22)21(29)31-18(13-28)14-7-6-10-16(11-14)30-15-8-4-3-5-9-15/h3-12,17-18,20H,1-2H3
50 atoms
Cl -4.638793 2.687456 -0.52553
F  -2.646898 2.598129 -3.849981
F  -4.403183 3.722721 -3.316053
F  -4.470905 1.576743 -3.332688
O  1.419139 0.428964 0.459504
O  0.94195 1.687914 -1.320952
O  2.922682 -3.920637 2.924701
N  1.493829 -1.783956 -2.119478
C  -0.58923 3.437223 0.782739
C  -1.629633 2.502298 0.234984
C  -0.29638 1.95323 0.72608
C  0.117423 4.413155 -0.125506
C  -0.847162 3.995858 2.162667
C  -2.026263 2.515364 -1.178031
C  0.717939 1.38136 -0.181696
C  -3.285631 2.599234 -1.593774
C  2.461067 -0.207422 -0.268241
C  -3.699722 2.623394 -3.035238
C  3.272585 -1.029951 0.699653
C  1.901134 -1.068647 -1.31821
C  2.669711 -2.092733 1.363933
C  4.607907 -0.730422 0.909781
C  3.424103 -2.87129 2.228522
C  5.349719 -1.508067 1.790158
C  4.768441 -2.576126 2.444403
C  1.756498 -4.520821 2.526957
C  0.727944 -4.613799 3.450195
C  1.624912 -5.068704 1.257832
C  -0.444139 -5.268825 3.100062
C  0.443482 -5.70698 0.915709
C  -0.592917 -5.811044 1.832913
H  -2.441832 2.281685 0.917499
H  -0.355286 1.435236 1.67587
H  -0.485888 5.316804 -0.222871
H  1.076071 4.702631 0.308127
H  0.310272 4.034018 -1.124385
H  0.089609 4.265401 2.653217
H  -1.462715 4.894399 2.100447
H  -1.366249 3.283124 2.804365
H  -1.253154 2.462081 -1.933099
H  3.099266 0.536924 -0.754522
H  1.623662 -2.315142 1.193324
H  5.073409 0.097033 0.389901
H  6.394205 -1.283794 1.959301
H  5.343623 -3.192254 3.122878
H  0.852183 -4.184004 4.435414
H  2.434164 -4.996917 0.542303
H  -1.246159 -5.347856 3.821915
H  0.336454 -6.127583 -0.075021
H  -1.510552 -6.314298 1.560297
totalener: -1928.16375056 hartree
nucrepener: 3084.81320879 hartree
electener: -5012.97695934 hartree
oneelecener: -8776.84017338 hartree
twoeener: 3763.86321404 hartree
kineticenergy: 1921.65865132 hartree
xcener: -157.116946139607 hartree
chargesum: 0.0000000
charge: -0.060613 -0.163592 -0.163052 -0.160191 -0.266512 -0.380519 -0.293970 -0.000256 0.066201 0.032925 -0.101608 -0.249690 -0.230543 -0.183890 0.358223 -0.075707 0.349067 0.504811 0.042322 -0.273069 -0.193759 -0.161702 0.229042 -0.090831 -0.203368 0.242578 -0.196197 -0.178225 -0.099189 -0.102623 -0.136277 0.083711 0.092163 0.096721 0.090944 0.104831 0.091968 0.095732 0.075214 0.157124 0.105672 0.127903 0.111267 0.127804 0.128870 0.125376 0.136708 0.126696 0.132552 0.128960
qa: -0.0606 -0.1636 -0.1631 -0.1602 -0.2665 -0.3805 -0.2940 -0.0003 0.0662 0.0329 -0.1016 -0.2497 -0.2305 -0.1839 0.3582 -0.0757 0.3491 0.5048 0.0423 -0.2731 -0.1938 -0.1617 0.2290 -0.0908 -0.2034 0.2426 -0.1962 -0.1782 -0.0992 -0.1026 -0.1363 0.0837 0.0922 0.0967 0.0909 0.1048 0.0920 0.0957 0.0752 0.1571 0.1057 0.1279 0.1113 0.1278 0.1289 0.1254 0.1367 0.1267 0.1326 0.1290
va: 1.2768 1.1424 1.1409 1.1462 2.1719 2.1045 2.1205 3.1146 3.7861 3.7729 3.9379 3.9109 3.9133 3.8732 4.1343 4.0402 3.8422 4.4892 3.7465 3.9763 3.9749 3.9834 3.8662 3.9734 4.0364 3.7867 4.0444 3.9779 3.9326 3.9440 3.9568 1.0370 1.0277 1.0022 1.0016 1.0174 1.0043 1.0040 1.0089 1.0262 1.0240 1.0225 1.0120 1.0003 1.0125 1.0125 1.0027 0.9991 0.9991 0.9997
dispcorr: -0.023958553 hartree
energy: -1928.187709110664
dipole: 32.96134 -31.83201 1.12933 -10.74277 11.26432 0.52155 31.35071 -29.11287 2.23784
magnitude: 2.56034 au
magnitude: 6.50787 debye
