program: Orca
programVersion: 5.0.2
elementType: Cl F F F O O O N C C C C C C C C C C C C C C C C C C C C C C C H H H H H H H H H H H H H H H H H H H
charge: 0
multiplicity: 1
keywords: wb97x-d3
keywords: def2-TZVPP
keywords: def2/J RIJCOSX
keywords: DEFGRID2
keywords: scfconv7
keywords: smallprint printgap noloewdin
keywords: NOSOSCF
formula: C23H19ClF3NO3
InChI: InChI=1/C23H19ClF3NO3/c1-22(2)17(12-19(24)23(25,26)27)20(22)21(29)31-18(13-28)14-7-6-10-16(11-14)30-15-8-4-3-5-9-15/h3-12,17-18,20H,1-2H3
50 atoms
Cl -4.252349 4.029296 -2.399533
F  -0.876209 4.276295 -4.295655
F  -2.479028 5.707693 -4.170236
F  -2.834594 3.773396 -5.035798
O  0.166464 -0.12586 -0.086847
O  0.767277 1.715571 -1.210541
O  1.112813 -3.970696 3.121266
N  0.486278 -2.538177 -2.381745
C  -1.290658 3.105689 0.69689
C  -2.059752 2.782323 -0.551299
C  -1.225514 1.702999 0.13227
C  -0.100546 4.031697 0.651819
C  -2.098838 3.251058 1.965065
C  -1.701101 3.332103 -1.863557
C  -0.000687 1.150564 -0.480108
C  -2.563729 3.874044 -2.715441
C  1.299805 -0.83584 -0.571252
C  -2.181509 4.410986 -4.063188
C  1.969198 -1.551231 0.572926
C  0.836693 -1.784025 -1.58945
C  1.252835 -2.467971 1.331658
C  3.302521 -1.298453 0.854838
C  1.875446 -3.124892 2.379995
C  3.918551 -1.966862 1.903571
C  3.214549 -2.877063 2.671073
C  1.660638 -5.129646 3.599541
C  2.40629 -5.973012 2.78567
C  1.400751 -5.466959 4.918544
C  2.896247 -7.159275 3.308489
C  1.88958 -6.661652 5.425746
C  2.642619 -7.508763 4.627119
H  -3.124211 2.640386 -0.405774
H  -1.806261 0.96146 0.667539
H  -0.444177 5.063457 0.737784
H  0.561334 3.833358 1.496154
H  0.491554 3.953512 -0.254601
H  -2.470092 4.271945 2.065235
H  -2.960452 2.582954 1.985153
H  -1.486083 3.030307 2.840416
H  -0.665326 3.291186 -2.170349
H  2.006197 -0.151251 -1.048773
H  0.214281 -2.684811 1.113618
H  3.861326 -0.585572 0.262066
H  4.957943 -1.771537 2.130063
H  3.700956 -3.388884 3.491226
H  2.595633 -5.712651 1.751995
H  0.81394 -4.798981 5.535251
H  3.474088 -7.818449 2.674374
H  1.683795 -6.925989 6.454449
H  3.024843 -8.438104 5.026713
totalener: -1928.16408039 hartree
nucrepener: 3001.37009909 hartree
electener: -4929.53417948 hartree
oneelecener: -8609.66123201 hartree
twoeener: 3680.12705253 hartree
kineticenergy: 1921.67310905 hartree
xcener: -157.119671711230 hartree
chargesum: -0.0000000
charge: -0.058254 -0.165261 -0.162575 -0.160009 -0.272709 -0.394816 -0.297432 0.004328 0.061110 0.047466 -0.118526 -0.248775 -0.231265 -0.193521 0.388532 -0.076440 0.338670 0.504417 0.035230 -0.273833 -0.197779 -0.138033 0.177959 -0.112556 -0.137714 0.210027 -0.138539 -0.194656 -0.121082 -0.098006 -0.134810 0.082542 0.092458 0.096310 0.091782 0.102710 0.095599 0.076304 0.092887 0.155738 0.118806 0.123486 0.117122 0.131209 0.136455 0.136905 0.125894 0.128932 0.126704 0.127010
qa: -0.0583 -0.1653 -0.1626 -0.1600 -0.2727 -0.3948 -0.2974 0.0043 0.0611 0.0475 -0.1185 -0.2488 -0.2313 -0.1935 0.3885 -0.0764 0.3387 0.5044 0.0352 -0.2738 -0.1978 -0.1380 0.1780 -0.1126 -0.1377 0.2100 -0.1385 -0.1947 -0.1211 -0.0980 -0.1348 0.0825 0.0925 0.0963 0.0918 0.1027 0.0956 0.0763 0.0929 0.1557 0.1188 0.1235 0.1171 0.1312 0.1365 0.1369 0.1259 0.1289 0.1267 0.1270
va: 1.2795 1.1399 1.1415 1.1464 2.1537 2.0949 2.1021 3.1161 3.7903 3.7514 3.9210 3.9136 3.9152 3.8729 4.1320 4.0483 3.7747 4.4867 3.7484 4.0428 4.0958 3.9690 3.9146 3.9696 3.9428 3.8230 3.9344 4.0288 3.9484 3.9417 3.9531 1.0367 1.0284 1.0021 1.0017 1.0169 1.0038 1.0087 1.0041 1.0291 1.0408 1.0288 1.0096 1.0015 1.0025 1.0023 1.0129 0.9998 0.9988 1.0000
dispcorr: -0.023330017 hartree
energy: -1928.187410402224
dipole: 25.19447 -24.19605 0.99842 -30.17863 30.00047 -0.17816 47.94101 -45.16032 2.78070
magnitude: 2.95988 au
magnitude: 7.52340 debye
