program: Orca
programVersion: 5.0.2
elementType: Cl F F F O O O N C C C C C C C C C C C C C C C C C C C C C C C H H H H H H H H H H H H H H H H H H H
charge: 0
multiplicity: 1
keywords: wb97x-d3
keywords: def2-TZVPP
keywords: def2/J RIJCOSX
keywords: DEFGRID2
keywords: scfconv7
keywords: smallprint printgap noloewdin
keywords: NOSOSCF
formula: C23H19ClF3NO3
InChI: InChI=1/C23H19ClF3NO3/c1-22(2)17(12-19(24)23(25,26)27)20(22)21(29)31-18(13-28)14-7-6-10-16(11-14)30-15-8-4-3-5-9-15/h3-12,17-18,20H,1-2H3
50 atoms
Cl -3.879285 1.697624 -0.759172
F  -2.99482 -1.136719 -0.983495
F  -1.10857 -0.744568 -1.946842
F  -2.953714 -0.228778 -2.930501
O  1.435042 1.63829 0.471611
O  1.552288 2.772351 2.389439
O  1.358446 -3.9294 0.185315
N  4.764065 2.064581 0.639543
C  -0.06652 4.08672 -0.602261
C  -1.107758 3.072125 -0.217652
C  -0.025682 3.479533 0.780672
C  0.977928 3.778346 -1.648443
C  -0.525579 5.525825 -0.654861
C  -1.178477 1.745032 -0.832825
C  1.054096 2.617348 1.311421
C  -2.302402 1.091968 -1.105876
C  2.49598 0.786322 0.889674
C  -2.336363 -0.260271 -1.749403
C  2.451851 -0.43939 0.014429
C  3.768668 1.50518 0.763017
C  1.912339 -1.608393 0.531405
C  2.900107 -0.390332 -1.299156
C  1.824091 -2.740137 -0.272229
C  2.806162 -1.52374 -2.090103
C  2.267964 -2.696126 -1.58652
C  0.369005 -3.94609 1.132989
C  -0.825622 -3.270516 0.927238
C  0.572472 -4.698217 2.278173
C  -1.821445 -3.347397 1.887048
C  -0.436866 -4.775228 3.22733
C  -1.631573 -4.097414 3.039436
H  -2.075358 3.488471 0.036376
H  -0.38522 4.13053 1.568717
H  1.87358 4.375999 -1.473561
H  1.283926 2.737915 -1.691826
H  0.590231 4.045707 -2.632425
H  -0.949901 5.756571 -1.633106
H  -1.285894 5.742841 0.095794
H  0.312327 6.203263 -0.484149
H  -0.257588 1.250916 -1.104126
H  2.37216 0.508221 1.940207
H  1.567967 -1.641249 1.55812
H  3.335147 0.516627 -1.699622
H  3.15421 -1.495982 -3.113675
H  2.194043 -3.582739 -2.202004
H  -0.978299 -2.69813 0.022824
H  1.508564 -5.222839 2.416931
H  -2.753119 -2.821992 1.724904
H  -0.282575 -5.365596 4.120678
H  -2.413902 -4.157626 3.783799
totalener: -1928.16053340 hartree
nucrepener: 3319.67863750 hartree
electener: -5247.83917090 hartree
oneelecener: -9245.81385070 hartree
twoeener: 3997.97467980 hartree
kineticenergy: 1921.68737069 hartree
xcener: -157.121073106494 hartree
chargesum: -0.0000000
charge: -0.053805 -0.169908 -0.172108 -0.157220 -0.269174 -0.331288 -0.296433 0.002697 0.066788 0.049670 -0.109726 -0.235796 -0.237174 -0.149197 0.348838 -0.100190 0.263279 0.524126 0.049308 -0.245268 -0.122696 -0.195364 0.184129 -0.101594 -0.167622 0.191636 -0.137394 -0.179362 -0.141480 -0.107591 -0.120340 0.081109 0.096474 0.106811 0.071207 0.095740 0.093094 0.076160 0.097372 0.123877 0.118022 0.119283 0.122154 0.129660 0.129904 0.142885 0.128797 0.131981 0.127908 0.127823
qa: -0.0538 -0.1699 -0.1721 -0.1572 -0.2692 -0.3313 -0.2964 0.0027 0.0668 0.0497 -0.1097 -0.2358 -0.2372 -0.1492 0.3488 -0.1002 0.2633 0.5241 0.0493 -0.2453 -0.1227 -0.1954 0.1841 -0.1016 -0.1676 0.1916 -0.1374 -0.1794 -0.1415 -0.1076 -0.1203 0.0811 0.0965 0.1068 0.0712 0.0957 0.0931 0.0762 0.0974 0.1239 0.1180 0.1193 0.1222 0.1297 0.1299 0.1429 0.1288 0.1320 0.1279 0.1278
va: 1.2851 1.1311 1.1289 1.1513 2.1025 2.1745 2.1112 3.1095 3.7771 3.7112 3.8830 3.9130 3.9213 3.8941 4.2270 4.0607 3.9006 4.4323 3.6317 3.9721 3.9204 4.0124 3.9135 3.9817 4.0272 3.8584 3.9368 4.0148 3.9748 3.9403 3.9447 1.0369 1.0269 1.0019 1.0151 1.0041 1.0034 1.0090 1.0031 1.0176 1.0236 1.0131 1.0163 0.9993 1.0111 1.0078 1.0118 1.0041 0.9989 0.9997
dispcorr: -0.028248211 hartree
energy: -1928.188781615022
dipole: 18.06162 -19.05359 -0.99197 10.88318 -10.76997 0.11321 8.34586 -8.71616 -0.37031
magnitude: 1.06487 au
magnitude: 2.70668 debye
