program: Orca
programVersion: 5.0.2
elementType: Cl F F F O O O N C C C C C C C C C C C C C C C C C C C C C C C H H H H H H H H H H H H H H H H H H H
charge: 0
multiplicity: 1
keywords: wb97x-d3
keywords: def2-TZVPP
keywords: def2/J RIJCOSX
keywords: DEFGRID2
keywords: scfconv7
keywords: smallprint printgap noloewdin
keywords: NOSOSCF
formula: C23H19ClF3NO3
InChI: InChI=1/C23H19ClF3NO3/c1-22(2)17(12-19(24)23(25,26)27)20(22)21(29)31-18(13-28)14-7-6-10-16(11-14)30-15-8-4-3-5-9-15/h3-12,17-18,20H,1-2H3
50 atoms
Cl -3.873692 3.68365 -0.451979
F  -3.779802 -0.111256 0.363039
F  -5.317559 1.039233 -0.60919
F  -4.755138 1.497462 1.412615
O  2.210999 1.792416 0.690145
O  0.410267 0.479556 0.555862
O  2.396977 -3.844299 -0.077989
N  4.882124 1.984812 2.61827
C  0.051819 2.212266 -2.077894
C  -0.970283 2.653425 -1.067424
C  0.493156 2.543424 -0.667468
C  0.080588 0.79156 -2.586281
C  0.430687 3.223001 -3.134649
C  -1.998641 1.742854 -0.555397
C  0.983005 1.48846 0.243573
C  -3.250865 2.08484 -0.278921
C  2.866202 0.788393 1.46713
C  -4.280474 1.119204 0.22576
C  3.315552 -0.365698 0.603579
C  3.995696 1.468891 2.101862
C  2.667051 -1.584935 0.724673
C  4.313345 -0.186125 -0.346045
C  2.994444 -2.626661 -0.133966
C  4.653084 -1.241881 -1.17623
C  3.992723 -2.456452 -1.084276
C  1.103415 -3.963621 0.354543
C  0.812257 -5.026895 1.195226
C  0.101251 -3.095161 -0.060161
C  -0.492055 -5.219276 1.625532
C  -1.194378 -3.288181 0.392535
C  -1.497476 -4.34784 1.23499
H  -1.298795 3.680652 -1.172442
H  1.011637 3.488644 -0.556273
H  -0.169889 0.044621 -1.838171
H  -0.624056 0.682003 -3.41163
H  1.074737 0.550206 -2.965495
H  -0.254248 3.163185 -3.981697
H  0.399629 4.245042 -2.75612
H  1.439372 3.036455 -3.506152
H  -1.728513 0.711316 -0.388852
H  2.203785 0.42585 2.259751
H  1.889006 -1.709011 1.466056
H  4.826467 0.763048 -0.434747
H  5.434808 -1.116638 -1.913212
H  4.246081 -3.276687 -1.742916
H  1.604266 -5.696303 1.504101
H  0.326948 -2.26745 -0.719459
H  -0.718013 -6.050587 2.28001
H  -1.971495 -2.601176 0.084448
H  -2.510983 -4.492394 1.583266
totalener: -1928.16328962 hartree
nucrepener: 3235.25073033 hartree
electener: -5163.41401995 hartree
oneelecener: -9077.14459791 hartree
twoeener: 3913.73057795 hartree
kineticenergy: 1921.68258429 hartree
xcener: -157.124112469119 hartree
chargesum: -0.0000000
charge: -0.056459 -0.169014 -0.161328 -0.159315 -0.249958 -0.397305 -0.295783 0.001804 0.045904 0.054540 -0.076215 -0.217572 -0.233153 -0.174022 0.362709 -0.089296 0.315861 0.505288 0.015491 -0.259119 -0.161686 -0.196270 0.250351 -0.086981 -0.205078 0.259246 -0.209040 -0.175575 -0.086809 -0.096699 -0.151666 0.082288 0.095240 0.050963 0.103961 0.097968 0.095961 0.077177 0.093685 0.140661 0.121149 0.126024 0.122481 0.130311 0.129689 0.125828 0.127595 0.126591 0.121947 0.127629
qa: -0.0565 -0.1690 -0.1613 -0.1593 -0.2500 -0.3973 -0.2958 0.0018 0.0459 0.0545 -0.0762 -0.2176 -0.2332 -0.1740 0.3627 -0.0893 0.3159 0.5053 0.0155 -0.2591 -0.1617 -0.1963 0.2504 -0.0870 -0.2051 0.2592 -0.2090 -0.1756 -0.0868 -0.0967 -0.1517 0.0823 0.0952 0.0510 0.1040 0.0980 0.0960 0.0772 0.0937 0.1407 0.1211 0.1260 0.1225 0.1303 0.1297 0.1258 0.1276 0.1266 0.1219 0.1276
va: 1.2816 1.1311 1.1434 1.1467 2.1520 2.0815 2.1268 3.1184 3.8374 3.7326 3.8725 3.9057 3.9120 3.8889 4.1647 4.0583 3.8411 4.4756 3.6034 4.0152 3.9230 4.0376 3.8655 3.9330 4.0423 3.8139 4.0363 3.9446 3.9272 3.9442 3.9804 1.0376 1.0283 1.0242 1.0045 1.0031 1.0033 1.0087 1.0040 1.0188 1.0163 1.0178 1.0167 0.9990 1.0119 1.0140 0.9931 0.9986 1.0062 1.0004
dispcorr: -0.027289054 hartree
energy: -1928.190578672761
dipole: 32.56938 -32.44745 0.12193 -13.63177 13.47365 -0.15813 -15.92907 14.45726 -1.47181
magnitude: 1.48529 au
magnitude: 3.77531 debye
