program: Orca
programVersion: 5.0.2
elementType: Cl F F F O O O N C C C C C C C C C C C C C C C C C C C C C C C H H H H H H H H H H H H H H H H H H H
charge: 0
multiplicity: 1
keywords: wb97x-d3
keywords: def2-TZVPP
keywords: def2/J RIJCOSX
keywords: DEFGRID2
keywords: scfconv7
keywords: smallprint printgap noloewdin
keywords: NOSOSCF
formula: C23H19ClF3NO3
InChI: InChI=1/C23H19ClF3NO3/c1-22(2)17(12-19(24)23(25,26)27)20(22)21(29)31-18(13-28)14-7-6-10-16(11-14)30-15-8-4-3-5-9-15/h3-12,17-18,20H,1-2H3
50 atoms
Cl -3.834245 3.580226 -0.420698
F  -4.725812 1.275792 1.275814
F  -3.704452 -0.25719 0.163217
F  -5.241678 0.91685 -0.779997
O  2.210445 1.805381 0.722796
O  0.407677 0.496302 0.580087
O  2.363359 -3.848604 0.095049
N  4.844821 2.021421 2.699786
C  0.140014 2.186733 -2.104982
C  -0.931798 2.602694 -1.136726
C  0.517137 2.534814 -0.68032
C  0.226329 0.764737 -2.603844
C  0.529367 3.203169 -3.152228
C  -1.950719 1.660648 -0.664932
C  0.989584 1.496825 0.259546
C  -3.201771 1.977362 -0.356377
C  2.840559 0.8157 1.538241
C  -4.223145 0.970935 0.080019
C  3.299336 -0.363829 0.714574
C  3.961447 1.502731 2.1811
C  2.632477 -1.572337 0.844224
C  4.327694 -0.218975 -0.208066
C  2.976041 -2.639045 0.023452
C  4.680976 -1.298555 -1.001136
C  4.005154 -2.503828 -0.898899
C  1.047766 -3.934157 0.464785
C  0.69846 -4.944762 1.347024
C  0.080205 -3.081251 -0.051702
C  -0.629834 -5.100975 1.714207
C  -1.240527 -3.237843 0.336895
C  -1.602092 -4.244914 1.219716
H  -1.286821 3.619472 -1.256566
H  1.007669 3.493109 -0.554147
H  -0.458619 0.624939 -3.44115
H  1.235226 0.555574 -2.962431
H  -0.010483 0.013855 -1.854774
H  -0.118955 3.117338 -4.025491
H  0.450801 4.225674 -2.781933
H  1.557402 3.046746 -3.482121
H  -1.677507 0.621509 -0.567212
H  2.157811 0.478432 2.324713
H  1.829124 -1.670194 1.562262
H  4.854875 0.721816 -0.303383
H  5.486761 -1.199956 -1.715892
H  4.269942 -3.343345 -1.528052
H  1.46408 -5.603035 1.735989
H  0.35268 -2.295045 -0.743496
H  -0.901308 -5.892096 2.400427
H  -1.991945 -2.564423 -0.052921
H  -2.634878 -4.360474 1.518689
totalener: -1928.16285390 hartree
nucrepener: 3246.60313881 hartree
electener: -5174.76599270 hartree
oneelecener: -9099.87891984 hartree
twoeener: 3925.11292713 hartree
kineticenergy: 1921.68893180 hartree
xcener: -157.124982466344 hartree
chargesum: 0.0000000
charge: -0.056422 -0.159181 -0.169262 -0.161457 -0.249833 -0.392742 -0.296661 0.001828 0.044735 0.059083 -0.074779 -0.213087 -0.232895 -0.166304 0.359607 -0.091894 0.315876 0.505320 0.014172 -0.259624 -0.152493 -0.193116 0.238830 -0.089674 -0.201249 0.250137 -0.204709 -0.169197 -0.088388 -0.098626 -0.152623 0.081760 0.095250 0.104849 0.097279 0.042905 0.095701 0.077328 0.093904 0.133135 0.121297 0.125448 0.122521 0.130140 0.129881 0.125944 0.130624 0.126268 0.122558 0.127835
qa: -0.0564 -0.1592 -0.1693 -0.1615 -0.2498 -0.3927 -0.2967 0.0018 0.0447 0.0591 -0.0748 -0.2131 -0.2329 -0.1663 0.3596 -0.0919 0.3159 0.5053 0.0142 -0.2596 -0.1525 -0.1931 0.2388 -0.0897 -0.2012 0.2501 -0.2047 -0.1692 -0.0884 -0.0986 -0.1526 0.0818 0.0952 0.1048 0.0973 0.0429 0.0957 0.0773 0.0939 0.1331 0.1213 0.1254 0.1225 0.1301 0.1299 0.1259 0.1306 0.1263 0.1226 0.1278
va: 1.2817 1.1475 1.1303 1.1429 2.1517 2.0855 2.1241 3.1188 3.8473 3.7232 3.8658 3.9031 3.9095 3.8943 4.1720 4.0621 3.8399 4.4743 3.6019 4.0163 3.9174 4.0338 3.8723 3.9350 4.0405 3.8241 4.0327 3.9424 3.9292 3.9493 3.9847 1.0370 1.0281 1.0040 1.0040 1.0266 1.0032 1.0086 1.0040 1.0159 1.0161 1.0191 1.0166 0.9991 1.0116 1.0137 0.9901 0.9986 1.0077 1.0005
dispcorr: -0.027545804 hartree
energy: -1928.190399700070
dipole: 32.60136 -32.46618 0.13518 -12.61094 12.48414 -0.12680 -15.26345 13.78466 -1.47879
magnitude: 1.49036 au
magnitude: 3.78819 debye
