program: Orca
programVersion: 5.0.2
elementType: Cl F F F O O O N C C C C C C C C C C C C C C C C C C C C C C C H H H H H H H H H H H H H H H H H H H
charge: 0
multiplicity: 1
keywords: wb97x-d3
keywords: def2-TZVPP
keywords: def2/J RIJCOSX
keywords: DEFGRID2
keywords: scfconv7
keywords: smallprint printgap noloewdin
keywords: NOSOSCF
formula: C23H19ClF3NO3
InChI: InChI=1/C23H19ClF3NO3/c1-22(2)17(12-19(24)23(25,26)27)20(22)21(29)31-18(13-28)14-7-6-10-16(11-14)30-15-8-4-3-5-9-15/h3-12,17-18,20H,1-2H3
50 atoms
Cl -3.895702 0.936767 0.177309
F  -3.322337 -1.171837 -1.77264
F  -1.427683 -0.427006 -2.477687
F  -3.243778 0.668896 -2.865554
O  1.720751 1.640796 -0.194697
O  2.535459 1.868905 1.868684
O  1.301684 -3.363261 0.45945
N  2.94957 1.203176 -3.224772
C  -0.571629 3.449553 0.829901
C  -1.080473 2.03537 0.911585
C  0.262783 2.396599 1.527165
C  -0.169411 4.035194 -0.502471
C  -1.225412 4.46323 1.739426
C  -1.257998 1.212838 -0.291334
C  1.609965 1.9464 1.112376
C  -2.420167 0.702789 -0.681576
C  2.974327 1.116629 -0.61365
C  -2.600705 -0.06772 -1.955652
C  3.193982 -0.295563 -0.122965
C  2.945097 1.169024 -2.076888
C  2.132169 -1.186394 -0.113419
C  4.44698 -0.68864 0.319993
C  2.318926 -2.465046 0.392796
C  4.634016 -1.986184 0.771148
C  3.573203 -2.874335 0.824728
C  0.052178 -2.924517 0.807165
C  -1.026984 -3.455122 0.118701
C  -0.145588 -2.017402 1.84225
C  -2.313616 -3.078677 0.472591
C  -1.436903 -1.63888 2.17347
C  -2.525564 -2.166155 1.494107
H  -1.846443 1.873148 1.661662
H  0.234964 2.459008 2.608703
H  -1.045125 4.477434 -0.979225
H  0.564059 4.830625 -0.361548
H  0.250228 3.319077 -1.202258
H  -1.52953 4.025841 2.690733
H  -0.542018 5.286057 1.954994
H  -2.115415 4.881966 1.267457
H  -0.406321 1.030447 -0.929696
H  3.793482 1.755555 -0.267295
H  1.156385 -0.893357 -0.481001
H  5.270462 0.013651 0.326382
H  5.609926 -2.300609 1.115217
H  3.705514 -3.877866 1.206474
H  -0.85511 -4.158841 -0.684881
H  0.696814 -1.611016 2.387657
H  -3.154575 -3.498147 -0.062188
H  -1.590196 -0.932448 2.978845
H  -3.530379 -1.865592 1.755688
totalener: -1928.15691005 hartree
nucrepener: 3442.08291910 hartree
electener: -5370.23982915 hartree
oneelecener: -9490.95518697 hartree
twoeener: 4120.71535782 hartree
kineticenergy: 1921.68947774 hartree
xcener: -157.125515556422 hartree
chargesum: -0.0000000
charge: -0.066189 -0.163561 -0.168827 -0.160208 -0.284186 -0.330221 -0.298549 0.010732 0.090381 0.022054 -0.111430 -0.244661 -0.237110 -0.195952 0.329855 -0.051277 0.252346 0.520303 0.120023 -0.255602 -0.189845 -0.169219 0.200593 -0.080415 -0.197776 0.252414 -0.196697 -0.162755 -0.102437 -0.121135 -0.153607 0.084031 0.098248 0.096098 0.098443 0.096948 0.075375 0.095788 0.094175 0.141296 0.129873 0.125042 0.105670 0.127679 0.130391 0.126343 0.133544 0.129733 0.123472 0.130807
qa: -0.0662 -0.1636 -0.1688 -0.1602 -0.2842 -0.3302 -0.2985 0.0107 0.0904 0.0221 -0.1114 -0.2447 -0.2371 -0.1960 0.3299 -0.0513 0.2523 0.5203 0.1200 -0.2556 -0.1898 -0.1692 0.2006 -0.0804 -0.1978 0.2524 -0.1967 -0.1628 -0.1024 -0.1211 -0.1536 0.0840 0.0982 0.0961 0.0984 0.0969 0.0754 0.0958 0.0942 0.1413 0.1299 0.1250 0.1057 0.1277 0.1304 0.1263 0.1335 0.1297 0.1235 0.1308
va: 1.2701 1.1386 1.1322 1.1445 2.0835 2.1744 2.1202 3.1097 3.8030 3.7102 3.9140 3.9208 3.9190 3.8521 4.2222 4.0095 3.9016 4.4546 3.5457 3.9947 3.9701 4.0549 3.9001 3.9468 4.0416 3.7855 4.0338 3.8958 3.8942 3.8843 3.8874 1.0315 1.0246 1.0043 1.0019 1.0093 1.0090 1.0035 1.0046 1.0161 1.0150 1.0169 1.0130 0.9995 1.0107 1.0133 1.0062 1.0012 1.0007 1.0083
dispcorr: -0.032914404 hartree
energy: -1928.189824453189
dipole: 17.67718 -17.71942 -0.04224 12.84428 -12.13301 0.71127 20.94730 -19.33520 1.61210
magnitude: 1.76254 au
magnitude: 4.48001 debye
