program: Orca
programVersion: 5.0.2
elementType: Cl F F F O O O N C C C C C C C C C C C C C C C C C C C C C C C H H H H H H H H H H H H H H H H H H H
charge: 0
multiplicity: 1
keywords: wb97x-d3
keywords: def2-TZVPP
keywords: def2/J RIJCOSX
keywords: DEFGRID2
keywords: scfconv7
keywords: smallprint printgap noloewdin
keywords: NOSOSCF
formula: C23H19ClF3NO3
InChI: InChI=1/C23H19ClF3NO3/c1-22(2)17(12-19(24)23(25,26)27)20(22)21(29)31-18(13-28)14-7-6-10-16(11-14)30-15-8-4-3-5-9-15/h3-12,17-18,20H,1-2H3
50 atoms
Cl -3.876858 3.043025 -2.556292
F  -5.065912 3.38846 0.176868
F  -3.622844 4.933367 -0.205221
F  -3.198718 3.402044 1.247422
O  2.06455 0.651256 -0.907888
O  0.427892 1.125953 0.547027
O  2.525354 -4.029713 1.204572
N  4.786473 2.530552 -0.615444
C  -1.260512 -0.34214 -1.656702
C  -1.509553 1.12764 -1.845273
C  -0.08393 0.61008 -1.741649
C  -1.615315 -1.026563 -0.359845
C  -1.466566 -1.22531 -2.86389
C  -2.132642 1.95478 -0.806685
C  0.77746 0.845343 -0.56778
C  -3.141563 2.792223 -1.016039
C  3.048237 0.724921 0.118639
C  -3.75954 3.633596 0.060714
C  3.655839 -0.642697 0.342541
C  4.025373 1.73065 -0.300074
C  2.787347 -1.678682 0.682415
C  5.015773 -0.874502 0.236745
C  3.29198 -2.949301 0.90908
C  5.508771 -2.152361 0.475041
C  4.661022 -3.187604 0.809466
C  1.201628 -3.893721 1.52147
C  0.271457 -4.531249 0.714881
C  0.799164 -3.198344 2.654006
C  -1.073473 -4.480693 1.052378
C  -0.548952 -3.140866 2.971063
C  -1.488615 -3.781647 2.175651
H  -1.77361 1.414529 -2.856554
H  0.460863 0.588951 -2.677848
H  -1.506341 -0.402905 0.522294
H  -2.652944 -1.361021 -0.399071
H  -0.993806 -1.911758 -0.215648
H  -2.509967 -1.535809 -2.935104
H  -1.207217 -0.719487 -3.79429
H  -0.853441 -2.125041 -2.791189
H  -1.750732 1.884929 0.201701
H  2.589753 1.077911 1.048144
H  1.725075 -1.491791 0.775907
H  5.697126 -0.077569 -0.02871
H  6.571133 -2.338345 0.39404
H  5.041895 -4.183929 0.990356
H  0.605972 -5.075484 -0.158649
H  1.53261 -2.713238 3.28547
H  -1.798601 -4.987222 0.429184
H  -0.86417 -2.598556 3.852407
H  -2.538044 -3.73929 2.433543
totalener: -1928.16376647 hartree
nucrepener: 3195.17245256 hartree
electener: -5123.33621903 hartree
oneelecener: -8996.83985107 hartree
twoeener: 3873.50363204 hartree
kineticenergy: 1921.66997132 hartree
xcener: -157.123704070984 hartree
chargesum: -0.0000000
charge: -0.058467 -0.162676 -0.160553 -0.166233 -0.258049 -0.388826 -0.290083 0.003467 0.095409 0.028649 -0.071362 -0.255430 -0.235063 -0.186211 0.338070 -0.076487 0.372456 0.504010 -0.058723 -0.283889 -0.183524 -0.182846 0.273682 -0.058057 -0.227209 0.229039 -0.163914 -0.168422 -0.137455 -0.110191 -0.123852 0.083653 0.094377 0.105928 0.100917 0.058185 0.094556 0.078609 0.092786 0.153084 0.136642 0.122965 0.129554 0.130504 0.127811 0.127016 0.135999 0.127529 0.132104 0.130522
qa: -0.0585 -0.1627 -0.1606 -0.1662 -0.2580 -0.3888 -0.2901 0.0035 0.0954 0.0286 -0.0714 -0.2554 -0.2351 -0.1862 0.3381 -0.0765 0.3725 0.5040 -0.0587 -0.2839 -0.1835 -0.1828 0.2737 -0.0581 -0.2272 0.2290 -0.1639 -0.1684 -0.1375 -0.1102 -0.1239 0.0837 0.0944 0.1059 0.1009 0.0582 0.0946 0.0786 0.0928 0.1531 0.1366 0.1230 0.1296 0.1305 0.1278 0.1270 0.1360 0.1275 0.1321 0.1305
va: 1.2793 1.1415 1.1455 1.1380 2.1241 2.0918 2.1282 3.1187 3.7745 3.7971 3.8945 3.9076 3.9123 3.8604 4.1551 4.0435 3.7678 4.4869 3.9398 4.0616 3.9340 3.9919 3.8109 3.9543 4.0414 3.7984 3.9711 3.9593 3.8994 3.9154 3.8922 1.0368 1.0301 1.0165 1.0062 1.0109 1.0036 1.0094 1.0034 1.0321 1.0241 1.0118 1.0239 0.9995 1.0144 1.0119 1.0022 1.0014 0.9991 0.9999
dispcorr: -0.027446160 hartree
energy: -1928.191212633713
dipole: 21.93216 -22.19969 -0.26754 -43.84667 41.50917 -2.33750 1.16892 -1.32302 -0.15410
magnitude: 2.35780 au
magnitude: 5.99306 debye
